{"text_format":"1","workbook":"xlsx","n_sheets":42,"sheets":["Konfig_A","Start","IPC RW-543A (Rack)","IPC RC-545A (Rack)","IPC RW-545A (Rack)","IPC547J (Rack)","IPC647E (Rack)","IPC847E (Rack)","IPC1047E (Rack)","IPC RS-828A (Rack)","IPC127E (Box)","IPC BX-21A (Box)","IPC227E (Nanobox)","IPC227G (Nanobox)","IPC327G (Basicbox)","IPC427E (Microbox)","IPC BX-39A (Box PC)","IPC BX-32A (Box)","IPC BX-56A","IPC BX-59A","IPC BX-35A(Box)","IPC627E (Box)","IPC277E (Panel PC)","IPC277G (Panel PC)","IPC277G PRO","IPC377G (Panel PC)","IPC477E (Panel PC)","IPC PX-32A (Panel PC)","IPC PX-39A (Panel PC)","IPC PX-39A PRO","IPC677E (Panel PC)","IPC MD-57A","IPC MD-34A","IFP V2","IFP Basic","IFP V2 HYG","ITC V3","Power Plugs BX & PX","DIME IPC","IPC CPU BENCHMARK","Accessori IPC PRO","SITOP DC UPS"],"not_rendered":{"charts":0,"images":106,"macros":1,"external_links":0,"defined_names":1586,"comments":0,"pivot_tables":0},"unopened":[],"bounds":{"document_bytes":16777216,"sheet_cells":100000,"rows_first":2000,"rows_last":500,"rows_between":2000,"halvings":0,"cell_chars":16384,"cell_head_chars":4096},"cells_cut":0,"cells_raw":0,"read":"whole","date_system":"1900"}

{"sheet":"Konfig_A","index":0,"n_rows":29,"n_cols":2,"rows_kept":29,"cut":false,"hidden":true,"merged":[]}
[]
["NoWorkTab","DeleteTab"]
["Konfig_A","KP-Ziegner"]
["Start"]
["Language"]
["User Information"]
["Delta"]
["KP-Ziegner"]
["SITOP DC UPS"]
["Power Plugs Rack Flat Panel"]
["Power Plugs Box Panel"]
[]
[]
[]
[]
[]
[]
[]
[]
[]
[]
[]
[]
[]
[]
[]
[]
[]
["----------------------","----------------------"]

{"sheet":"Start","index":1,"n_rows":56,"n_cols":27,"rows_kept":56,"cut":false,"hidden":false,"merged":[[39,13,44,13],[46,13,51,13]]}
[null,null,null,"MLFB product search:",null,null,null,"Abilitare le macro per un corretto funzionamento!",null,null,null,null,null,null,null,null," ==> Software Packages"," ==>  SITOP DC UPS E ASSORBIMENTI",null,{"$f":"COLUMN()","v":20},{"$f":"COLUMN()","v":21},{"$f":"COLUMN()","v":22},"destination_row","Jump & Configure the sheet according MLFB","Default MLFB"]
[null,null,null,null,null,null,null,null,null,null,null,null,null,null,null,null," ==> IPC Benchmark","==> Software controller"]
[null,null,null,null,null,null,null,null,null,null,null,null,null,null,"V28.1 ITA",null,"==>ACCESSORI PER IPC e MONITOR PRO","==> DIME IPC",null,null,null,null,null,null,null,"6AG4012-0"]
[null,null,null,null,null,null,null,null,null,null,null,null,null,null,null,null,"==> Upgrade O.S. a Win 10 LTSC 2019","==> Upgrade O.S. a Win 10 LTSC 2021",null,"R5…"]
[null,null,"SIMATIC IPC RC- / RW- / RS-",null,"RS-828A New",null,"         RW-543A New",null,"RC-545A New",null,"RW-545A New",null,"   547J",null,"        647E","           847E","    1047E",null,null,"127E","6AG4021-0A","IPC127E (Box)",5,1,"6AG4021-0AA11-0AA0"]
[null,null,null,null,null,null,null,null,null,null,null,null,null,null,null,null,null,null,null,"BX21A","6AG4021-0B","IPC BX-21A (Box)",5,1,"6AG4021-0BC00-1AA1",null,"B"]
[null,null,"RC: Rack Client",null,null,null,null,null,null,null,null,null,null,null,null,null,null,null,null,"227E","6ES7647-8B","IPC227E (Nanobox)",5,1,"6ES7647-8BA11-0AA1"]
[null,null,"RW: Rack Workstation",null,null,null,null,null,null,null,null,null,null,null,null,null,null,null,null,"227G","6ES7647-8C","IPC227G (Nanobox)",5,1,"6ES7647-8CB11-1AA0"]
[null,null,"RS: Rack Server",null,null,null,null,null,null,null,null,null,null,null,null,null,null,null,null,"227G_PRO","6AV7886-1","IPC277G PRO",5,1,"6AG4022-0BA21-0AA1"]
[null,null,null,null,null,null,null,null,null,null,null,null,null,null,null,null,null,null,null,"327G","6AG4022-0B","IPC327G (Basicbox)",5,1,"6AG4141-0AA00-0AA0"]
[null,null,null,null,null,null,null,null,null,null,null,null,null,null,null,null,null,null,null,"RW543A","6AG4011-3","IPC RW-543A (Rack)",5,1,"6AG4011-3AA04-0XX0"]
[null,null,"SIMATIC IPC BX-",null,"BX-21A New",null,"127E ",null,"227E   ",null,"     227G",null," 327G",null,"BX-32A New","BX-35A New",null,null,null,"427E","6AG4141","IPC427E (Microbox)",5,1,"6AG4141-0AA00-0AA0"]
[null,null,null,null,null,null,null,null,null,null,null,null,null,null,null,null,null,null,null,"BX32A","6AG4152","IPC BX-32A (Box)",5,1,"6AG4152-1AA00-0AA1"]
[null,null,"BX: Box PC",null,null,null,null,null,null,null,null,null,null,null,null,null,null,null,null,"BX35A","6ES7647","IPC BX-35A(Box)",5,1,"6ES7647-0JC10-0YA2"]
[null,null,null,null,null,null,null,null,null,null,null,null,null,null,null,null,null,null,null,"BX39A","6AG4142","IPC BX-39A (Box PC)",5,1,"6AG4142-1AA00-0AA0"]
[null,null,null,null,null,null,null,null,null,null,null,null,null,null,null,null,null,null,null,"527G","6AG4025-0","IPC527G (Box)",5,1,"6AG4131-2AA10-0XX0"]
[null,null,null,null,null,null,null,null,null,null,null,null,null,null,null,null,null,null,null,"BX56A","6AG4132","IPC BX-56A",5,1,"6AG4132-0DA00-0AX7"]
[null,null,null,null,null,null,null,null,null,null,null,null,null,null,null,null,null,null,null,"627E","6AG4131-3","IPC627E (Box)",5,1,"6AG4132-2AA10-0XX0"]
[null,null,null,null,"BX-39A",null," 427E",null,"BX-56A New",null,"BX-59A New",null,"627E"]
[]
[]
[]
[]
[]
[null,null,null,null,null,null,null,null,null,null,null,null,null,null,null,null,null,null,null,"PX32A","6AV7272","IPC PX-32A (Panel PC)",5,1,"6AV7272-1AA00-0AA1"]
[null,null,"SIMATIC IPC PX-",null,"277E",null,"277G ",null,"277G Pro ",null,"377G",null," PX-32A ",null,"PX-39A",null,null,null,null,"PX39A","6AV7242","IPC PX-39A (Panel PC)",5,1,"6AV7260-0AA10-0XX0"]
[null,null,null,null,null,null,null,null,null,null,null,null,null,null,null,null,null,null,null,"PX39A_PRO","6AV7252","IPC PX-39A PRO (Panel PC)",5,1,"6AV7261-0AA00-8AA0"]
[null,null,"PX: Panel PC",null,null,null,null,null,null,null,null,null,null,null,null,null,null,null,null,"677E","6AV7261","IPC677E (Panel PC)",5,1,"6AG4104-4EA00-0XX0"]
[null,null,null,null,null,null,null,null,null,null,null,null,null,null,null,null,null,null,null,"347G","6AG4012-2","IPC347G (Rack)",5,1,"6AG4104-5CX00-0AX0"]
[null,null,null,null,null,null,null,null,null,null,null,null,null,null,null,null,null,null,null,"RC545A","6AG4103-6","IPC RC-545A (Rack)",5,1,"6AG4103-6AX00-0AX0"]
[null,null,null,null,null,null,null,null,null,null,null,null,null,null,null,null,null,null,null,"547J","6AG4104-5","IPC547J (Rack)",5,1,"6AG4112-3AX00-0XX0"]
[]
[null,null,null,null,"PX-39A Pro ",null,"   477E",null,"677E          "]
[]
[]
[]
[]
[null,null,null,null,null,null,null,null,null,null,null,null,null,null,null,null,null,null,null,"IFPBasic","6AV7862-2B","IFP Basic",5,1,"6AV7200-7AA00-0AA0"]
[null,null,null,null,null,null,null,null,null,null,null,null,null,null,null,null,null,null,null,"MD34A","6AV7880-","IPC MD-34A",5,1,"6AV7863-2AA00-0AA0"]
[null,null,"SIMATIC IPC IM-",null,"IFP V2",null,"        IFP Basic",null,"IFP V2 HYG",null,"ITC V3 / ITC V3 Pro",null,null,null,null,null,null,null,null,"IFP_V2","6AV7863","IFP V2",5,0,"6AV7863-5MA10-1AA0"]
[null,null,null,null,null,null,null,null,null,null,null,null,null,null,null,null,null,null,null,"Flat Panel","6AV7861","FlatPanel",5,0,"6AV7862-2BC00-0AA0"]
[null,null,"IM: Industrial Monitor",null,null,null,null,null,null,null,null,null,null,null,null,null,null,null,null,"IFPBasic","6AV7862-2B","IFP Basic"]
[null,null,null,null,null,null,null,null,null,null,null,null,null,null,null,null,null,null,null,"ITC_V3","6AV6646-1B","ITC V3"]
[]
[]
[]
[null,null,"SIMATIC IPC MD-",null,"    IPC MD-34A",null,"    IPC MD-57A"]
[]
[null,null,"MD: Mobile Device"]
[]
[]
[]
[]
[]
[null,null,null,null,null,null,null,null,null,null,null,null,null,null,null,null,null,null,"til Row100 (macro relevant)"]
[null,null,null,null,null,null,null,null,null,null,null,null,null,null,null,null,null,null,null,"before publication please turn color to \"white on white\" everything right from column \"S\" "]

{"sheet":"IPC RW-543A (Rack)","index":2,"n_rows":59,"n_cols":19,"rows_kept":59,"cut":false,"hidden":false,"merged":[]}
["SIMATIC IPC RW-543A",null,null,null,null,null,null,null,null,null,null,null,null,null,null,null,{"$f":"IF(OR(($G$5=\"#\"),($H$5=\"#\"),($I$5=\"#\"),($J$5=\"#\"),($L$5=\"#\"),($M$5=\"#\")),\"CONFIGURATION NOT POSSIBLE\",\"\")","v":""}]
[]
[null,null,null,null,null,null,null,null,null,null,null,null,null,null,null,null,null,{"$f":"$A$5&$B$5&$C$5&$D$5&$E$5&$F$5&$G$5&$H$5&$I$5&$J$5&$K$5&$L$5&$M$5&$N$5&$O$5","v":"6AG4011-3AA04-0XX1"}]
[]
["6AG4",0,1,1,"-",3,{"$f":"IF(P7=1,G19,IF(P7=2,G20,IF(P7=3,G21,IF(P7=4,G22,IF(P7=5,G23,IF(P7=6,#REF!,IF(P7=7,#REF!,IF(P7=8,#REF!,IF(P7=9,#REF!,IF(P7=10,#REF!,IF(P7=11,#REF!)))))))))))","v":"A"},{"$f":"IF(P8=1,H26,)&IF(P8=2,H27,)&IF(P8=3,H28,)&IF(P8=4,H29,)&IF(P8=5,H30,)&IF(P8=6,#REF!,)&IF(P8=7,#REF!,)&IF(P8=8,#REF!,)&IF(P8=9,#REF!,)&IF(P8=10,#REF!,)&IF(P8=11,#REF!,)&IF(P8=12,#REF!,)&IF(P8=13,#REF!,)&IF(P8=14,#REF!,)&IF(P8=15,#REF!,)&IF(P8=16,#REF!,)&IF(P8=17,#REF!,)&IF(P8=18,#REF!,)&IF(P8=19,#REF!,)&IF(P8=20,#REF!,)&IF(P8=21,#REF!,)","v":"A"},{"$f":"IF(P9=1,I33,IF(P9=2,I34,IF(P9=3,I35,IF(P9=4,I36,IF(P9=5,I37,IF(P9=6,I38,IF(P9=7,#REF!,IF(P9=6,#REF!))))))))","v":0},{"$f":"IF(P10=1,J41,IF(P10=2,J42,IF(P10=3,J43,IF(P10=4,J44,IF(P10=5,J45,IF(P10=6,#REF!,IF(P10=7,#REF!,IF(P10=8,#REF!,IF(P10=9,#REF!)))))))))","v":4},"-",{"$f":"IF(P11=1,L49,IF(P11=2,#REF!,IF(P11=3,#REF!,IF(P11=4,#REF!))))","v":0},{"$f":"IF(P12=1,M52,IF(P12=2,M53,IF(P12=3,M54,IF(P12=4,#REF!,IF(P12=5,#REF!,IF(P12=6,#REF!,IF(P12=7,#REF!,IF(P12=8,#REF!,IF(P12=9,#REF!)))))))))","v":"X"},"X",1,null,"SIMATIC IPC RW-543A (Rack PC, 19\", 4U)"]
[null,null,null,null,null,null,"|","|","|","|",null,"|","|",null,null,2,"Mainboard (Chipset Q470): 2x Gigabit Ethernet, 2x USB 2.0 (front), 4x USB 3.2,2x USB 2.0 (rear), 1x USB2.0 (internal), 1x HDMI,1x DVI-D, 1x VGA, 2x COM, 1x PS/2, Audio "]
[null,null,null,null,null,null,"|","|","|","|",null,"|","|",null,null,1,{"$f":"IF(P7=1,Q19,IF(P7=2,Q20,IF(P7=3,Q21,IF(P7=4,Q22,IF(P7=5,Q23,IF(P7=6,#REF!,IF(P7=7,#REF!,IF(P7=8,#REF!,IF(P7=9,#REF!,IF(P7=10,#REF!,IF(P7=11,#REF!)))))))))))","v":"Intel Pentium G6400(2C/4T, 4.0GHz, 4MB Cache)"}]
[null,null,null,null,null,null,"|","|","|","|",null,"|","|",null,null,1,{"$f":"IF(P8=1,Q26,)&IF(P8=2,Q27,)&IF(P8=3,Q28,)&IF(P8=4,Q29,)&IF(P8=5,Q30,)&IF(P8=7,#REF!,)&IF(P8=8,#REF!,)&IF(P8=9,#REF!,)&IF(P8=10,#REF!,)&IF(P8=11,#REF!,)&IF(P8=12,#REF!,)&IF(P8=13,#REF!,)&IF(P8=14,#REF!,)&IF(P8=15,#REF!,)&IF(P8=16,#REF!,)&IF(P8=17,#REF!,)&IF(P8=18,#REF!,)&IF(P8=19,#REF!,)&IF(P8=20,#REF!,)&IF(P8=21,#REF!,)","v":"1x 1 TB HDD"}]
[null,null,null,null,null,null,"|","|","|","|",null,"|","|",null,null,1,{"$f":"IF(P9=1,Q33,IF(P9=2,Q34,IF(P9=3,Q35,IF(P9=4,Q36,IF(P9=5,Q37,IF(P9=6,Q38,IF(P9=7,#REF!)))))))","v":"4GB DDR4 SDRAM"},"Link utili"]
[null,null,null,null,null,null,"|","|","|","|",null,"|","|",null,null,4,{"$f":"IF(P10=1,Q41,IF(P10=2,Q42,IF(P10=3,Q43,IF(P10=4,Q44,IF(P10=5,Q45,IF(P10=6,#REF!,IF(P10=7,#REF!,IF(P10=8,#REF!,IF(P10=9,#REF!)))))))))","v":"Eco chassis, 350W"},"Certificati"]
[null,null,null,null,null,null,"|","|","|","|",null,"|","|",null,null,1,{"$f":"IF(P11=1,Q49,IF(P11=2,#REF!,IF(P11=3,#REF!,IF(P11=4,#REF!,IF(P11=5,#REF!,IF(P11=6,#REF!))))))","v":"."},"Datasheet"]
[null,null,null,null,null,null,"|","|","|","|",null,"|","|",null,null,3,{"$f":"IF(P12=1,Q52,IF(P12=2,Q53,IF(P12=3,Q54,IF(P12=4,#REF!,IF(P12=5,#REF!,IF(P12=6,#REF!,IF(P12=7,#REF!,IF(P12=8,#REF!,IF(P12=9,#REF!)))))))))","v":"W/o operating system;"},"Manuale"]
[null,null,null,null,null,null,"|","|","|","|",null,"|","|",null,null,0,null,"CAD 2D/3D"]
[null,null,null,null,null,null,"|","|","|","|",null,"|","|"]
[null,null,null,null,null,null,"|","|","|","|",null,"|","|"]
[null,null,null,null,null,null,"|","|","|","|",null,"|","|"]
[null,null,null,null,null,null,"|","|","|","|",null,"|","|"]
[null,null,null,null,null,null,"|","|","|","|",null,"|","|",null,null,null,"Processors"]
[null,null,null,null,null,null,"A","|","|","|",null,"|","|",null,null,null,"Intel Pentium G6400(2C/4T, 4.0GHz, 4MB Cache)",null,{"$f":"IF(AND($P$7=1,G19=\"A\"),1,\"\")","v":1}]
[null,null,null,null,null,null,"B","|","|","|",null,"|","|",null,null,null,"Intel Core i3-10100E (4C/8T, 3.2 (3.8) GHz, 6 MB Cache) ",null,{"$f":"IF(AND($P$7=2,G20=\"B\"),1,\"\")","v":""}]
[null,null,null,null,null,null,"C","|","|","|",null,"|","|",null,null,null,"Intel Core i5-10500E (6C/12T, 3.1 (4.2) GHz, 12 MB Cache) ",null,{"$f":"IF(AND($P$7=3,G21=\"C\"),1,\"\")","v":""}]
[null,null,null,null,null,null,"D","|","|","|",null,"|","|",null,null,null,"Intel Core i7-10700E (8C/16T, 2.9 (4.5) GHz, 16 MB Cache)",null,{"$f":"IF(AND($P$7=4,G22=\"D\"),1,\"\")","v":""}]
[null,null,null,null,null,null,"E","|","|","|",null,"|","|",null,null,null,"Intel Core i9-10900E (10C/20T, 2.8 (4.7) GHz, 20 MB Cache) ",null,{"$f":"IF(AND($P$7=5,G23=\"E\"),1,\"\")","v":""}]
[null,null,null,null,null,null,null,"|","|","|",null,"|","|"]
[null," ",null,null,null,null,null,"|","|","|",null,"|","|",null,null,null,"Drives (SATA)"]
[null,null,null,null,null,null,null,"A","|","|",null,"|","|",null,null,null,"1x 1 TB HDD",null,{"$f":"IF(AND($P$8=1,H26=\"A\"),1,\"\")","v":1}]
[null,null,null,null,null,null,null,"B","|","|",null,"|","|",null,null,null,"2x 1T HDD",null,{"$f":"IF(AND($P$8=2,H27=\"B\"),1,\"\")","v":""}]
[null,null,null,null,null,null,null,"C","|","|",null,"|","|",null,null,null,"1x 256G SSD",null,{"$f":"IF(AND($P$8=3,H28=\"C\"),1,\"\")","v":""}]
[null,null,null,null,null,null,null,"D","|","|",null,"|","|",null,null,null,"1x 512G SSD",null,{"$f":"IF(AND($P$8=4,H29=\"D\"),1,\"\")","v":""}]
[null,null,null,null,null,null,null,"E","|","|",null,"|","|",null,null,null,"1TB HDD+ 256G SSD",null,{"$f":"IF(AND($P$8=5,H30=\"E\"),1,\"\")","v":""}]
[null,null,null,null,null,null,null,null,"|","|",null,"|","|"]
[null,null,null,null,null,null,null,null,"|","|",null,"|","|",null,null,null,"Main Memory"]
[null,null,null,null,null,null,null,null,0,"|",null,"|","|",null,null,null,"4GB DDR4 SDRAM",null,{"$f":"IF(AND($P$9=1,I33=0),1,\"\")","v":1}]
[null,null,null,null,null,null,null,null,1,"|",null,"|","|",null,null,null,"8GB DDR4 SDRAM",null,{"$f":"IF(AND($P$9=2,I34=1),1,\"\")","v":""}]
[null,null,null,null,null,null,null,null,2,"|",null,"|","|",null,null,null,"16GB DDR4 SDRAM",null,{"$f":"IF(AND($P$9=3,I35=2),1,\"\")","v":""}]
[null,null,null,null,null,null,null,null,3,"|",null,"|","|",null,null,null,"32GB DDR4 SDRAM",null,{"$f":"IF(AND($P$9=4,I36=3),1,\"\")","v":""}]
[null,null,null,null,null,null,null,null,4,"|",null,"|","|",null,null,null,"64GB DDR4 SDRAM(2x32GB DDR4 SDRAM)",null,{"$f":"IF(AND($P$9=5,I37=4),1,\"\")","v":""}]
[null,null,null,null,null,null,null,null,5,"|",null,"|","|",null,null,null,"128GB DDR4 SDRAM(4x32GB DDR4 SDRAM)",null,{"$f":"IF(AND($P$9=6,I38=5),1,\"\")","v":""}]
[null,null,null,null,null,null,null,null,null,"|",null,"|","|"]
[null,null,null,null,null,null,null,null,null,"|",null,"|","|",null,null,null,"Type of Housing "]
[null,null,null,null,null,null,null,null,null,{"$f":"IF(OR(($P$7=1),($P$7=2),($P$7=3),($P$7=4)),0,\"#\")","v":0},null,"|","|",null,null,null,"Standard chassis,350W",null,{"$f":"IF(AND($P$10=1,J41=0),1,\"\")","v":""}]
[null,null,null,null,null,null,null,null,null,{"$f":"IF(OR(($P$7=1),($P$7=2),($P$7=3),($P$7=4)),1,\"#\")","v":1},null,"|","|",null,null,null,"Standard chassis,500W",null,{"$f":"IF(AND($P$10=2,J42=1),1,\"\")","v":""}]
[null,null,null,null,null,null,null,null,null,{"$f":"IF(OR(($P$7=1),($P$7=2),($P$7=3),($P$7=4),($P$7=5)),2,\"#\")","v":2},null,"|","|",null,null,null,"standard chassis,850W",null,{"$f":"IF(AND($P$10=3,J43=2),1,\"\")","v":""}]
[null,null,null,null,null,null,null,null,null,{"$f":"IF(OR(($P$7=1),($P$7=2),($P$7=3),($P$7=4)),4,\"#\")","v":4},null,"|","|",null,null,null,"Eco chassis, 350W",null,{"$f":"IF(AND($P$10=4,J44=4),1,\"\")","v":1}]
[null,null,null,null,null,null,null,null,null,{"$f":"IF(OR(($P$7=1),($P$7=2),($P$7=3),($P$7=4)),5,\"#\")","v":5},null,"|","|",null,null,null,"Eco chassis,500W",null,{"$f":"IF(AND($P$10=5,J45=5),1,\"\")","v":""}]
[null,null,null,null,null,null,null,null,null,null,null,"|","|"]
[null,null,null,null,null,null,null,null,null,null,null,"|","|"]
[null,null,null,null,null,null,null,null,null,null,null,"|","|",null,null,null,"Extension"]
[null,null,null,null,null,null,null,null,null,null,null,0,"|",null,null,null,".",null,1]
[null,null,null,null,null,null,null,null,null,null,null,null,"|"]
[null,null,null,null,null,null,null,null,null,null,null,null,"|",null,null,null,"Operating Systems (pre-installed and activated)"]
[null,null,null,null,null,null,null,null,null,null,null,null,{"$f":"IF(OR(($P$7=1),($P$7=2),($P$7=3)),\"A\",\"#\")","v":"A"},null,null,null,"Windows 10 IoT Enterprise 2021 LTSC, Multi Language (En, Ger, Fr, It, Sp), 64 bit;[for processors Core i3 / i5]",null,{"$f":"IF(AND($P$12=1),1,\"\")","v":""}]
[null,null,null,null,null,null,null,null,null,null,null,null,{"$f":"IF(OR(($P$7=4),($P$7=5)),\"B\",\"#\")","v":"#"},null,null,null,"Windows 10 IoT Enterprise 2021 LTSC, Multi Language (En, Ger, Fr, It, Sp), 64 bit;[for processor Core i7 / i9 ]",null,{"$f":"IF(AND($P$12=2),1,\"\")","v":""}]
[null,null,null,null,null,null,null,null,null,null,null,null,"X",null,null,null,"W/o operating system;",null,{"$f":"IF(AND($P$12=3),1,\"\")","v":1}]
[]
[]
[null,null,null,null,null,null,null,null,null,null,null,null,null,null,null,null,null," IPC base ",1]
[]
[null,null,null,null,null,null,null,null,null,null,null,null,null,null,null,null,null,"Total:"]

{"sheet":"IPC RC-545A (Rack)","index":3,"n_rows":89,"n_cols":19,"rows_kept":89,"cut":false,"hidden":false,"merged":[]}
["SIMATIC IPC RC-545A",null,null,null,null,null,null,null,null,null,null,null,null,null,null,null,""]
[]
[null,null,null,null,null,null,null,null,null,null,null,null,null,null,null,null,{"$f":"IF(E30,F30,\"\")","v":""}]
[]
["6AG4",1,0,3,"-",6,{"$f":"IF(P6=1,G20,)&IF(P6=2,G21,)&IF(P6=3,G22,)&IF(P6=4,#REF!,)&IF(P6=5,#REF!,)&IF(P6=6,#REF!,)&IF(P6=7,#REF!,)&IF(P6=8,#REF!,)&IF(P6=9,#REF!,)","v":"A"},{"$f":"IF(P7=1,H25,)&IF(P7=2,H26,)&IF(P7=3,H27,)&IF(P7=4,H28,)&IF(P7=5,H29,)&IF(P7=6,H30,)","v":"A"},0,{"$f":"IF(P9=1,J36,IF(P9=2,J37,IF(P9=3,J38,IF(P9=4,J39,IF(P9=5,#REF!,IF(P9=6,#REF!,IF(P9=7,#REF!,IF(P9=8,#REF!,))))))))","v":0},"-",{"$f":"IF(P10=1,L42,IF(P10=2,L43,IF(P10=3,L44,IF(P10=4,L45,IF(P10=5,L46,IF(P10=6,L47,))))))","v":0},{"$f":"IF(P11=1,M50,IF(P11=2,M51))","v":"A"},{"$f":"IF(P12=1,N54,IF(P12=2,N55,IF(P12=3,N56,IF(P12=4,N57,IF(P12=5,N58)))))","v":"A"},{"$f":"IF(P13=1,O61,IF(P13=2,O62,IF(P13=3,O63,IF(P13=4,O64,IF(P13=5,#REF!,IF(P13=6,#REF!,IF(P13=7,#REF!)))))))","v":0},null,"SIMATIC IPC RC-545A (Rack PC, 19\", 4U)",{"$f":"$A$5&$B$5&$C$5&$D$5&$E$5&$F$5&$G$5&$H$5&$I$5&$J$5&$K$5&$L$5&$M$5&$N$5&$O$5","v":"6AG4103-6AA00-0AA0"}]
[null,null,null,null,null,null,"|","|","|","|",null,"|","|","|","|",1,{"$f":"IF(P6=1,Q20,IF(P6=2,Q21,IF(P6=3,Q22,IF(P6=4,#REF!))))","v":"Core i3-12100E 4C(4P)/8T, 3.2 (4.2) GHz, 12 MB Cache"}]
[null,null,null,null,null,null,"|","|","|","|",null,"|","|","|","|",1,{"$f":"IF(P7=1,Q25,IF(P7=2,Q26,IF(P7=3,Q27,IF(P7=4,Q28,IF(P7=5,Q29,IF(P7=6,Q30))))))","v":"1 TB HDD 3.5\" SATA"}]
[null,null,null,null,null,null,"|","|","|","|",null,"|","|","|","|",1,{"$f":"IF(P8=1,Q33,IF(P8=2,#REF!,IF(P8=3,#REF!,IF(P8=4,#REF!))))","v":"without NVMe drives"}]
[null,null,null,null,null,null,"|","|","|","|",null,"|","|","|","|",1,{"$f":"IF(P9=1,Q36,IF(P9=2,Q37,IF(P9=3,Q38,IF(P9=4,Q39,IF(P9=5,#REF!)))))","v":"8 GB DDR5 SDRAM (1x 8 GB)"}]
[null,null,null,null,null,null,"|","|","|","|",null,"|","|","|","|",1,{"$f":"IF(P10=1,Q42,IF(P10=2,Q43,IF(P10=3,Q44,IF(P10=4,Q45,IF(P10=5,Q46,IF(P10=6,Q47))))))","v":"Housing(short) with drive cage type C (for internally mounted / 0,2 g vibration, 2 g shock),blue chromated"}]
[null,null,null,null,null,null,"|","|","|","|",null,"|","|","|","|",1,{"$f":"IF(P11=1,Q50,IF(P11=2,Q51))","v":"550W 100/240V AC industrial power supply"}]
[null,null,null,null,null,null,"|","|","|","|",null,"|","|","|","|",1,{"$f":"IF(P12=1,Q54,IF(P12=2,Q55,IF(P12=3,Q56,IF(P12=4,Q57,IF(P12=5,Q58)))))","v":"Windows 10 IoT Enterprise 2021 LTSC, Multi Language (en, ge, fr, It, sp), 64 bit; for Core i3 / i5; without USB-Drive (Restore-Image; D&D)"}]
[null,null,null,null,null,null,"|","|","|","|",null,"|","|","|","|",1,{"$f":"IF(P13=1,Q61,IF(P13=2,Q62,IF(P13=3,Q63,IF(P13=4,Q64))))","v":"without power cord;"},"Link utili"]
[null,null,null,null,null,null,"|","|","|","|",null,"|","|","|","|",null,"Mainboard (Chipset H610E):2x Ethernet (2x 1 Gbit), 1x DVI-D, 2x DisplayPort, 1x COM,","Certificati"]
[null,null,null,null,null,null,"|","|","|","|",null,"|","|","|","|",null,"2x USB 3.2 Gen.1 Typ A, 4x USB 2.0 Typ A, 1x USB 2.0 Type A intern; TPM2.0, audio,","Datasheet"]
[null,null,null,null,null,null,"|","|","|","|",null,"|","|","|","|",null,"2x USB3.1 Gen1(Type A) frontside; ","Manuali"]
[null,null,null,null,null,null,"|","|","|","|",null,"|","|","|","|",null,"7 Slots: 1x PCIe x16(16L),1x PCIe x16(2L), 1x PCIe x8(1L), 2x PCIe x4(1L), 2x PCI;","CAD 2D/3D"]
[null,null,null,null,null,null,"|","|","|","|",null,"|","|","|","|"]
[null,null,null,null,null,null,"|","|","|","|",null,"|","|","|","|",null,"Processor"]
[null,null,null,null,null,null,"A","|","|","|",null,"|","|","|","|",null,"Core i3-12100E 4C(4P)/8T, 3.2 (4.2) GHz, 12 MB Cache",null,{"$f":"IF($P$6=1,\"X\",\"\")","v":"X"}]
[null,null,null,null,null,null,"B","|","|","|",null,"|","|","|","|",null,"Core i5-12500E 6C(6P)/12T, 2.9 (4.5) GHz, 18 MB Cache",null,{"$f":"IF($P$6=2,\"X\",\"\")","v":""}]
[null,null,null,null,null,null,"C","|","|","|",null,"|","|","|","|",null,"Core i7-12700E 12C(8P+4E)/20T, 2.1 (4.8) GHz, 25 MB Cache",null,{"$f":"IF($P$6=3,\"X\",\"\")","v":""}]
[null,null,null,null,null,null,null,"|","|","|",null,"|","|","|","|"]
[null,null,null,null,null,null,null,"|","|","|",null,"|","|","|","|",null,"Drives 1, SATA"]
[null,null,null,null,null,null,null,"A","|","|",null,"|","|","|","|",null,"1 TB HDD 3.5\" SATA",null,{"$f":"IF($P$7=1,\"X\",\"\")","v":"X"}]
[null,null,null,null,null,null,null,"B","|","|",null,"|","|","|","|",null,"2x 1 TB HDD 3.5\" SATA",null,{"$f":"IF($P$7=2,\"X\",\"\")","v":""}]
[null,null,null,null,null,null,null,"C","|","|",null,"|","|","|","|",null,"480 GB SSD 2.5\" SATA",null,{"$f":"IF($P$7=3,\"X\",\"\")","v":""}]
[null,null,null,null,null,null,null,"D","|","|",null,"|","|","|","|",null,"960 GB SSD 2.5\" SATA",null,{"$f":"IF($P$7=4,\"X\",\"\")","v":""}]
[null,null,null,null,null,null,null,"E","|","|",null,"|","|","|","|",null,"2x 960 GB SSD 2.5\" SATA",null,{"$f":"IF($P$7=5,\"X\",\"\")","v":""}]
[null,null,null,null,{"$f":"IF(AND(OR(P8=1),OR(P12=1,P12=2,P12=3,P12=4),P7=6),1,0)","v":0},"CONFIGURATION NOT POSSIBLE: Operating system is only with HDD/SSD drives available",null,"X","|","|",null,"|","|","|","|",null,"without SATA drives",null,{"$f":"IF($P$7=6,\"X\",\"\")","v":""}]
[null,null,null,null,null,null,null,null,"|","|",null,"|","|","|","|"]
[null,null,null,null,null,null,null,null,"|","|",null,"|","|","|","|",null,"Drives 2, NVMe"]
[null,null,null,null,null,null,null,null,0,"|",null,"|","|","|","|",null,"without NVMe drives",null,{"$f":"IF($P$8=1,\"X\",\"\")","v":"X"}]
[null,null,null,null,null,null,null,null,null,"|",null,"|","|","|","|"]
[null,null,null,null,null,null,null,null,null,"|",null,"|","|","|","|",null,"Main Memory"]
[null,null,null,null,null,null,null,null,null,0,null,"|","|","|","|",null,"8 GB DDR5 SDRAM (1x 8 GB)",null,{"$f":"IF($P$9=1,\"X\",\"\")","v":"X"}]
[null,null,null,null,null,null,null,null,null,1,null,"|","|","|","|",null,"16 GB DDR5 SDRAM (2x 8 GB)",null,{"$f":"IF($P$9=2,\"X\",\"\")","v":""}]
[null,null,null,null,null,null,null,null,null,2,null,"|","|","|","|",null,"32 GB DDR5 SDRAM (2x 16 GB)",null,{"$f":"IF($P$9=3,\"X\",\"\")","v":""}]
[null,null,null,null,null,null,null,null,null,3,null,"|","|","|","|",null,"64 GB DDR5 SDRAM (2x 32 GB)",null,{"$f":"IF($P$9=4,\"X\",\"\")","v":""}]
[null,null,null,null,null,null,null,null,null,null,null,"|","|","|","|"]
[null,null,null,null,null,null,null,null,null,null,null,"|","|","|","|",null,"Type of Housing; interfaces"]
[null,null,null,null,null,null,null,null,null,null,null,0,"|","|","|",null,"Housing(short) with drive cage type C (for internally mounted / 0,2 g vibration, 2 g shock),blue chromated",null,{"$f":"IF($P$10=1,\"X\",\"\")","v":"X"}]
[null,null,null,null,null,null,null,null,null,null,null,1,"|","|","|",null,"Housing with drive cage type B (for internally mounted / 0,5 g vibration, 5 g shock),blue chromated",null,{"$f":"IF($P$10=2,\"X\",\"\")","v":""}]
[null,null,null,null,null,null,null,null,null,null,null,3,"|","|","|",null,"Housing with drive cage type A (for frontside mounted removable tray),blue chromated",null,{"$f":"IF($P$10=3,\"X\",\"\")","v":""}]
[null,null,null,null,null,null,null,null,null,null,null,5,"|","|","|",null,"Housing(short) with drive cage type C (for internally mounted / 0,2 g vibration, 2 g shock),blue chromated+2x COM interface",null,{"$f":"IF($P$10=4,\"X\",\"\")","v":""}]
[null,null,null,null,null,null,null,null,null,null,null,6,"|","|","|",null,"Housing with drive cage type B (for internally mounted / 0,5 g vibration, 5 g shock),blue chromated+2x COM interface",null,{"$f":"IF($P$10=5,\"X\",\"\")","v":""}]
[null,null,null,null,null,null,null,null,null,null,null,7,"|","|","|",null,"Housing with drive cage type A (for frontside mounted removable tray),blue chromated+2x COM interface",null,{"$f":"IF($P$10=6,\"X\",\"\")","v":""}]
[null,null,null,null,null,null,null,null,null,null,null,null,"|","|","|"]
[null,null,null,null,null,null,null,null,null,null,null,null,"|","|","|",null,"Power supplies; graphics card"]
[null,null,null,null,null,null,null,null,null,null,null,null,"A","|","|",null,"550W 100/240V AC industrial power supply",null,{"$f":"IF($P$11=1,\"X\",\"\")","v":"X"}]
[null,{"$f":"IF(AND(OR($P$7=17,$P$7=18,$P$7=19,$P$7=20,),$P$11=5),1,0)","v":0},"The selected combination is not valid: PCIe x8 RAID controller only with Windows server OS or Windows 7, 64Bit"," .",null,null,null,null,null,null,null,null,"D","|","|",null,"graphics card NVIDIA T400 (4 GB, 3x mDP: 3x Adapter mDP to DP); 550W 100/240V AC industrial power supply",null,{"$f":"IF($P$11=2,\"X\",\"\")","v":""}]
[null,null,null,null,null,null,null,null,null,null,null,null,null,"|","|"]
[null,null,null,null,null,null,null,null,null,null,null,null,null,"|","|",null,"Operating Systems (pre-installed and activated)"]
[null,null,null,null,null,null,null,null,null,null,null,null,null,{"$f":"IF(OR(($P$6=3),($P$6=4),($P$6=7),($P$6=8),($P$6=9)),\"!\",\"A\")","v":"A"},"|",null,"Windows 10 IoT Enterprise 2021 LTSC, Multi Language (en, ge, fr, It, sp), 64 bit; for Core i3 / i5; without USB-Drive (Restore-Image; D&D)",null,{"$f":"IF($P$12=1,\"X\",\"\")","v":"X"}]
[null,null,null,null,null,null,null,null,null,null,null,null,null,{"$f":"IF(OR(($P$6=1),($P$6=2),($P$6=5),($P$6=6)),\"!\",\"B\")","v":"!"},"|",null,"Windows 10 IoT Enterprise 2021 LTSC, Multi Language (en, ge, fr, It, sp), 64 bit; for Core i7 / i9; without USB-Drive (Restore-Image; D&D)",null,{"$f":"IF($P$12=2,\"X\",\"\")","v":""}]
[null,null,null,null,null,null,null,null,null,null,null,null,null,{"$f":"IF(OR(($P$6=3),($P$6=4),($P$6=7),($P$6=8),($P$6=9)),\"!\",\"C\")","v":"C"},"|",null,"Windows 10 IoT Enterprise 2021 LTSC, Multi Language (en, ge, fr, It, sp), 64 bit; for Core i3 / i5; with USB-Drive (Restore-Image; D&D)",null,{"$f":"IF($P$12=3,\"X\",\"\")","v":""}]
[null,null,null,null,null,null,null,null,null,null,null,null,null,{"$f":"IF(OR(($P$6=1),($P$6=2),($P$6=5),($P$6=6)),\"!\",\"D\")","v":"!"},"|",null,"Windows 10 IoT Enterprise 2021 LTSC, Multi Language (en, ge, fr, It, sp), 64 bit; for Core i7 / i9; with USB-Drive (Restore-Image; D&D)",null,{"$f":"IF($P$12=4,\"X\",\"\")","v":""}]
[null,null,null,null,null,null,null,null,null,null,null,null,null,"X","|",null,"without operating System; without USB-Drive (Restore-Image; D&D)",null,{"$f":"IF($P$12=5,\"X\",\"\")","v":""}]
[null,null,null,null,null,null,null,null,null,null,null,null,null,null,"|"]
[null,null,null,null,null,null,null,null,null,null,null,null,null,null,"|",null,"power cord"]
[null,null,null,null,null,null,null,null,null,null,null,null,null,null,0,null,"without power cord;",null,{"$f":"IF($P$13=1,\"X\",\"\")","v":"X"}]
[null,null,null,null,null,null,null,null,null,null,null,null,null,null,1,null,"power cord Europe;",null,{"$f":"IF($P$13=2,\"X\",\"\")","v":""}]
[null,null,null,null,null,null,null,null,null,null,null,null,null,null,2,null,"power cord USA;",null,{"$f":"IF($P$13=3,\"X\",\"\")","v":""}]
[null,null,null,null,null,null,null,null,null,null,null,null,null,null,3,null,"power cord China;",null,{"$f":"IF($P$13=4,\"X\",\"\")","v":""}]
[]
[null,null,null,null,null,null,null,null,null,null,null,null,null,null,null,null," IPC base ",null,"X"]
[]
[{"$f":"A$5","v":"6AG4"},1,0,3,"-",6,{"$f":"G5","v":"A"},{"$f":"H5","v":"A"},{"$f":"I5","v":0},{"$f":"J5","v":0},"-",{"$f":"L5","v":0},{"$f":"M5","v":"A"},{"$f":"N5","v":"A"},{"$f":"O5","v":0},null,null,"Total:"]
[]
[]
["Accessories:"]
[null,null,null,null,null,null,null,null,null,null,null,null,null,null,null,null,"Memory Extension"]
["6ES7648-2AM70-0SA0",null,null,null,null,null,null,null,null,null,null,null,null,null,null,null,"8 GB DDR5 DIMM (1x 8); "]
["6ES7648-2AM80-0SA0",null,null,null,null,null,null,null,null,null,null,null,null,null,null,null,"16 GB DDR5 DIMM (1x 16); "]
["6ES7648-2AM81-0SA0",null,null,null,null,null,null,null,null,null,null,null,null,null,null,null,"32 GB DDR5 DIMM (1x 32); "]
[]
[null,null,null,null,null,null,null,null,null,null,null,null,null,null,null,null,"Hardware accessory"]
["6ES7648-0EH00-1BA0",null,null,null,null,null,null,null,null,null,null,null,null,null,null,null,"removable tray for 3.5\" HDD (SATA/SAS) or 2.5\" SSD (SATA), w/o drive"]
["6ES7648-1AA00-0XK0",null,null,null,null,null,null,null,null,null,null,null,null,null,null,null,"Retainer to interlock the internal USB interface"]
[]
[null,null,null,null,null,null,null,null,null,null,null,null,null,null,null,null,"Mounting accessory"]
["6ES7648-1AA01-0XC0",null,null,null,null,null,null,null,null,null,null,null,null,null,null,null,"Tower Kit for converting the Rack IPC into an Industrial Tower PC  IPC547J/IPC847E/IPC RW-545A/IPC RC-545A"]
["6ES7648-1AA01-0XE0",null,null,null,null,null,null,null,null,null,null,null,null,null,null,null,"Tower Kit for converting the Rack IPC into an Industrial Tower PC for IPC547J/IPC RC-545A (short enclosure)"]
[]
[null,null,null,null,null,null,null,null,null,null,null,null,null,null,null,null,"Adapter Cable"]
["6ES7648-3AF00-0XA0",null,null,null,null,null,null,null,null,null,null,null,null,null,null,null,"Adapter cable DisplayPort to DVI-D for onboard graphics"]
["6ES7648-3AG00-0XA0",null,null,null,null,null,null,null,null,null,null,null,null,null,null,null,"Adapter cable DisplayPort to VGA for onboard graphics"]
[]
[null,null,null,null,null,null,null,null,null,null,null,null,null,null,null,null," "]

{"sheet":"IPC RW-545A (Rack)","index":4,"n_rows":104,"n_cols":19,"rows_kept":104,"cut":false,"hidden":false,"merged":[]}
["SIMATIC IPC RW-545A",null,null,null,null,null,null,null,null,null,null,null,null,null,null,null,{"$f":"IF(OR(($G$5=\"!\"),($H$5=\"!\"),($I$5=\"!\"),($J$5=\"!\"),($L$5=\"!\"),($M$5=\"!\"),($N$5=\"!\"),($O$5=\"!\")),\"CONFIGURATION NOT POSSIBLE\",\"\")","v":""}]
[]
[null,null,null,null,null,null,null,null,null,null,null,null,null,null,null,null,{"$f":"IF(E35,F35,\"\")","v":""}]
[]
["6AG4",1,0,4,"-",6,{"$f":"IF(P6=1,G20,)&IF(P6=2,G21,)&IF(P6=3,G22,)&IF(P6=4,G23,)&IF(P6=5,#REF!,)&IF(P6=6,#REF!,)&IF(P6=7,#REF!,)&IF(P6=8,#REF!,)&IF(P6=9,#REF!,)","v":"A"},{"$f":"IF(P7=1,H26,)&IF(P7=2,H27,)&IF(P7=3,H28,)&IF(P7=4,H29,)&IF(P7=5,H30,)&IF(P7=6,H31,)&IF(P7=7,H32,)&IF(P7=8,H33,)&IF(P7=9,H34,)&IF(P7=10,H35,)","v":"A"},{"$f":"IF(P8=1,I38,IF(P8=2,I39,IF(P8=3,I40,IF(P8=4,I41,IF(P8=5,#REF!,)))))","v":0},{"$f":"IF(P9=1,J44,IF(P9=2,J45,IF(P9=3,J46,IF(P9=4,J47,IF(P9=5,J48,IF(P9=6,#REF!,IF(P9=7,#REF!,IF(P9=8,#REF!,))))))))","v":0},"-",{"$f":"IF(P10=1,L51,IF(P10=2,L52,IF(P10=3,L53,IF(P10=4,L54,IF(P10=5,L55,IF(P10=6,L56,))))))","v":1},{"$f":"IF(P11=1,M59,IF(P11=2,M60,IF(P11=3,M61,IF(P11=4,M62,IF(P11=5,M63,IF(P11=6,M64,IF(P11=7,M65,)))))))","v":"A"},{"$f":"IF(P12=1,N70,IF(P12=2,N71,IF(P12=3,N72,IF(P12=4,N73,IF(P12=5,N74)))))","v":"X"},{"$f":"IF(P13=1,O77,IF(P13=2,O78,IF(P13=3,O79,IF(P13=4,O80,IF(P13=5,#REF!,IF(P13=6,#REF!,IF(P13=7,#REF!)))))))","v":0},null,"SIMATIC IPC RW-545A (Rack PC, 19\", 4U)",{"$f":"$A$5&$B$5&$C$5&$D$5&$E$5&$F$5&$G$5&$H$5&$I$5&$J$5&$K$5&$L$5&$M$5&$N$5&$O$5","v":"6AG4104-6AA00-1AX0"}]
[null,null,null,null,null,null,"|","|","|","|",null,"|","|","|","|",1,{"$f":"IF(P6=1,Q20,IF(P6=2,Q21,IF(P6=3,Q22,IF(P6=4,Q23))))","v":"Core i3-12100E 4C(4P)/8T, 3.2 (4.2) GHz, 12 MB Cache"}]
[null,null,null,null,null,null,"|","|","|","|",null,"|","|","|","|",1,{"$f":"IF(P7=1,Q26,IF(P7=2,Q27,IF(P7=3,Q28,IF(P7=4,Q29,IF(P7=5,Q30,IF(P7=6,Q31,IF(P7=7,Q32,IF(P7=8,Q33,IF(P7=9,Q34,IF(P7=10,Q35,))))))))))","v":"1 TB HDD 3.5\" SATA"}]
[null,null,null,null,null,null,"|","|","|","|",null,"|","|","|","|",1,{"$f":"IF(P8=1,Q38,IF(P8=2,Q39,IF(P8=3,Q40,IF(P8=4,Q41))))","v":"without NVMe drives"}]
[null,null,null,null,null,null,"|","|","|","|",null,"|","|","|","|",1,{"$f":"IF(P9=1,Q44,IF(P9=2,Q45,IF(P9=3,Q46,IF(P9=4,Q47,IF(P9=5,Q48)))))","v":"8 GB DDR5 SDRAM (1x 8 GB)"}]
[null,null,null,null,null,null,"|","|","|","|",null,"|","|","|","|",1,{"$f":"IF(P10=1,Q51,IF(P10=2,Q52,IF(P10=3,Q53,IF(P10=4,Q54,IF(P10=5,Q55,IF(P10=6,Q56))))))","v":"Housing with drive cage type B (for internally mounted / 0,5 g vibration, 5 g shock),blue chromated"}]
[null,null,null,null,null,null,"|","|","|","|",null,"|","|","|","|",1,{"$f":"IF(P11=1,Q59,IF(P11=2,Q60,IF(P11=3,Q61,IF(P11=4,Q62,IF(P11=5,Q63,IF(P11=6,Q64,IF(P11=7,Q65,IF(P11=8,Q66,IF(P11=9,Q67)))))))))","v":"550W 100/240V AC industrial power supply"}]
[null,null,null,null,null,null,"|","|","|","|",null,"|","|","|","|",5,{"$f":"IF(P12=1,Q70,IF(P12=2,Q71,IF(P12=3,Q72,IF(P12=4,Q73,IF(P12=5,Q74)))))","v":"without operating System; without USB-Drive (Restore-Image; D&D)"}]
[null,null,null,null,null,null,"|","|","|","|",null,"|","|","|","|",1,{"$f":"IF(P13=1,Q77,IF(P13=2,Q78,IF(P13=3,Q79,IF(P13=4,Q80))))","v":"without power cord;"},"Link utili"]
[null,null,null,null,null,null,"|","|","|","|",null,"|","|","|","|",null,"Mainboard (Chipset R680E):3x Ethernet (2x 1 Gbit, 1x 2,5 Gbit), 1x DVI-D, 3x DisplayPort,","Certificati"]
[null,null,null,null,null,null,"|","|","|","|",null,"|","|","|","|",null,"4x USB 3.2 Gen.2 Typ A, 2x USB 3.2 Gen.2x2 Typ C, 2x USB 2.0 Type A intern; TPM2.0, audio,","Datasheet"]
[null,null,null,null,null,null,"|","|","|","|",null,"|","|","|","|",null,"2x USB3.1 Gen1(Type A) frontside; ","Manuali"]
[null,null,null,null,null,null,"|","|","|","|",null,"|","|","|","|",null,"7 Slots: 2x PCIe x16(1x 16L oder 2x 8L), 1x PCIe x8(4L), 3x PCIe x4(4L), 1x PCI; 2x M.2 Slots;","CAD 2D/3D"]
[null,null,null,null,null,null,"|","|","|","|",null,"|","|","|","|"]
[null,null,null,null,null,null,"|","|","|","|",null,"|","|","|","|",null,"Processor"]
[null,null,null,null,null,null,"A","|","|","|",null,"|","|","|","|",null,"Core i3-12100E 4C(4P)/8T, 3.2 (4.2) GHz, 12 MB Cache",null,{"$f":"IF($P$6=1,\"X\",\"\")","v":"X"}]
[null,null,null,null,null,null,"B","|","|","|",null,"|","|","|","|",null,"Core i5-12500E 6C(6P)/12T, 2.9 (4.5) GHz, 18 MB Cache",null,{"$f":"IF($P$6=2,\"X\",\"\")","v":""}]
[null,null,null,null,null,null,"C","|","|","|",null,"|","|","|","|",null,"Core i7-12700E 12C(8P+4E)/20T, 2.1 (4.8) GHz, 25 MB Cache",null,{"$f":"IF($P$6=3,\"X\",\"\")","v":""}]
[null,null,null,null,null,null,"D","|","|","|",null,"|","|","|","|",null,"Core i9-12900E 16C(8P+8E)/24T, 2.3 (5.0) GHz, 30 MB Cache",null,{"$f":"IF($P$6=4,\"X\",\"\")","v":""}]
[null,null,null,null,null,null,null,"|","|","|",null,"|","|","|","|"]
[null,null,null,null,null,null,null,"|","|","|",null,"|","|","|","|",null,"Drives 1, SATA"]
[null,null,null,null,null,null,null,"A","|","|",null,"|","|","|","|",null,"1 TB HDD 3.5\" SATA",null,{"$f":"IF($P$7=1,\"X\",\"\")","v":"X"}]
[null,null,null,null,null,null,null,"B","|","|",null,"|","|","|","|",null,"2x 1 TB HDD 3.5\" SATA",null,{"$f":"IF($P$7=2,\"X\",\"\")","v":""}]
[null,null,null,null,null,null,null,"C","|","|",null,"|","|","|","|",null,"480 GB SSD 2.5\" SATA",null,{"$f":"IF($P$7=3,\"X\",\"\")","v":""}]
[null,null,null,null,null,null,null,"D","|","|",null,"|","|","|","|",null,"960 GB SSD 2.5\" SATA",null,{"$f":"IF($P$7=4,\"X\",\"\")","v":""}]
[null,null,null,null,null,null,null,"E","|","|",null,"|","|","|","|",null,"2x 960 GB SSD 2.5\" SATA",null,{"$f":"IF($P$7=5,\"X\",\"\")","v":""}]
[null,null,null,null,null,null,null,"H","|","|",null,"|","|","|","|",null,"RAID1, 2x 480 GB SSD 2.5\" SATA",null,{"$f":"IF($P$7=6,\"X\",\"\")","v":""}]
[null,null,null,null,null,null,null,"J","|","|",null,"|","|","|","|",null,"RAID1, 2x 960 GB SSD 2.5\" SATA",null,{"$f":"IF($P$7=7,\"X\",\"\")","v":""}]
[null,null,null,null,null,null,null,"K","|","|",null,"|","|","|","|",null,"RAID1, 2x 2 TB HDD [Enterprise] 3.5\" SATA ",null,{"$f":"IF($P$7=8,\"X\",\"\")","v":""}]
[null,null,null,null,null,null,null,"L","|","|",null,"|","|","|","|",null,"RAID1, 2x 4 TB HDD [Enterprise] 3.5\" SATA ",null,{"$f":"IF($P$7=9,\"X\",\"\")","v":""}]
[null,null,null,null,{"$f":"IF(AND(OR(P8=1),OR(P12=1,P12=2,P12=3,P12=4),P7=10),1,0)","v":0},{"$f":"\"CONFIGURATION NOT POSSIBLE\"&\": \"&\"Operating system is only with HDD/SSD drives available\"","v":"CONFIGURATION NOT POSSIBLE: Operating system is only with HDD/SSD drives available"},null,"X","|","|",null,"|","|","|","|",null,"without SATA drives",null,{"$f":"IF($P$7=10,\"X\",\"\")","v":""}]
[null,null,null,null,null,null,null,null,"|","|",null,"|","|","|","|"]
[null,null,null,null,null,null,null,null,"|","|",null,"|","|","|","|",null,"Drives 2, NVMe"]
[null,null,null,null,null,null,null,null,0,"|",null,"|","|","|","|",null,"without NVMe drives",null,{"$f":"IF($P$8=1,\"X\",\"\")","v":"X"}]
[null,null,null,null,null,null,null,null,1,"|",null,"|","|","|","|",null,"512 GB SSD M.2 NVMe(M.2 Slot occupied)",null,{"$f":"IF($P$8=2,\"X\",\"\")","v":""}]
[null,null,null,null,null,null,null,null,2,"|",null,"|","|","|","|",null,"1024 GB SSD M.2 NVMe(M.2 Slot occupied)",null,{"$f":"IF($P$8=3,\"X\",\"\")","v":""}]
[null,null,null,null,null,null,null,null,3,"|",null,"|","|","|","|",null,"2x 1024 GB SSD M.2 NVMe(M.2 Slot occupied)",null,{"$f":"IF($P$8=4,\"X\",\"\")","v":""}]
[null,null,null,null,null,null,null,null,null,"|",null,"|","|","|","|"]
[null,null,null,null,null,null,null,null,null,"|",null,"|","|","|","|",null,"Main Memory"]
[null,null,null,null,null,null,null,null,null,0,null,"|","|","|","|",null,"8 GB DDR5 SDRAM (1x 8 GB)",null,{"$f":"IF($P$9=1,\"X\",\"\")","v":"X"}]
[null,null,null,null,null,null,null,null,null,1,null,"|","|","|","|",null,"16 GB DDR5 SDRAM (2x 8 GB)",null,{"$f":"IF($P$9=2,\"X\",\"\")","v":""}]
[null,null,null,null,null,null,null,null,null,2,null,"|","|","|","|",null,"32 GB DDR5 SDRAM (2x 16 GB)",null,{"$f":"IF($P$9=3,\"X\",\"\")","v":""}]
[null,null,null,null,null,null,null,null,null,3,null,"|","|","|","|",null,"64 GB DDR5 SDRAM (2x 32 GB)",null,{"$f":"IF($P$9=4,\"X\",\"\")","v":""}]
[null,null,null,null,null,null,null,null,null,4,null,"|","|","|","|",null,"128 GB DDR5 SDRAM (4x 32 GB)",null,{"$f":"IF($P$9=5,\"X\",\"\")","v":""}]
[null,null,null,null,null,null,null,null,null,null,null,"|","|","|","|"]
[null,null,null,null,null,null,null,null,null,null,null,"|","|","|","|",null,"Type of Housing; interfaces"]
[null,null,null,null,null,null,null,null,null,null,null,1,"|","|","|",null,"Housing with drive cage type B (for internally mounted / 0,5 g vibration, 5 g shock),blue chromated",null,{"$f":"IF($P$10=1,\"X\",\"\")","v":"X"}]
[null,null,null,null,null,null,null,null,null,null,null,3,"|","|","|",null,"Housing with drive cage type A (for frontside mounted removable tray),blue chromated",null,{"$f":"IF($P$10=2,\"X\",\"\")","v":""}]
[null,null,null,null,null,null,null,null,null,null,null,4,"|","|","|",null,"Housing with drive cage type A (for frontside mounted removable tray),painted",null,{"$f":"IF($P$10=3,\"X\",\"\")","v":""}]
[null,null,null,null,null,null,null,null,null,null,null,6,"|","|","|",null,"Housing with drive cage type B (for internally mounted / 0,5 g vibration, 5 g shock),blue chromated+2x COM interface",null,{"$f":"IF($P$10=4,\"X\",\"\")","v":""}]
[null,null,null,null,null,null,null,null,null,null,null,7,"|","|","|",null,"Housing with drive cage type A (for frontside mounted removable tray),blue chromated+2x COM interface",null,{"$f":"IF($P$10=5,\"X\",\"\")","v":""}]
[null,null,null,null,null,null,null,null,null,null,null,8,"|","|","|",null,"Housing with drive cage type A (for frontside mounted removable tray),painted+2x COM interface",null,{"$f":"IF($P$10=6,\"X\",\"\")","v":""}]
[null,null,null,null,null,null,null,null,null,null,null,null,"|","|","|"]
[null,null,null,null,null,null,null,null,null,null,null,null,"|","|","|",null,"Power supplies; graphics card"]
[null,null,null,null,null,null,null,null,null,null,null,null,"A","|","|",null,"550W 100/240V AC industrial power supply",null,{"$f":"IF($P$11=1,\"X\",\"\")","v":"X"}]
[null,null,null,null,null,null,null,null,null,null,null,null,"B","|","|",null,"850W 100/240V AC industrial power supply",null,{"$f":"IF($P$11=2,\"X\",\"\")","v":""}]
[null,{"$f":"IF(AND(OR($P$6=7,$P$6=8,$P$6=9,$P$6=10,$P$6=11,$P$6=12,),$P$11=4),1,0)","v":0},"The selected combination is not valid: PCIe x8 RAID controller only with Windows server OS or Windows 7, 64Bit"," .",null,null,null,null,null,null,null,null,"C","|","|",null,"700W 2x100/240V AC redundant industrial power supply",null,{"$f":"IF($P$11=3,\"X\",\"\")","v":""}]
[null,{"$f":"IF(AND(OR($P$7=17,$P$7=18,$P$7=19,$P$7=20,),$P$11=5),1,0)","v":0},"The selected combination is not valid: PCIe x8 RAID controller only with Windows server OS or Windows 7, 64Bit"," .",null,null,null,null,null,null,null,null,"D","|","|",null,"graphics card NVIDIA T400 (4 GB, 3x mDP: 3x Adapter mDP to DP); 550W 100/240V AC industrial power supply",null,{"$f":"IF($P$11=4,\"X\",\"\")","v":""}]
[null,null,null,null,null,null,null,null,null,null,null,null,"E","|","|",null,"graphics card NVIDIA RTX A2000 (12 GB, 4x mDP: 3x Adapter mDP to DP); 550W 100/240V AC industrial power supply",null,{"$f":"IF($P$11=5,\"X\",\"\")","v":""}]
[null,null,null,null,null,null,null,null,null,null,null,null,"F","|","|",null,"graphics card NVIDIA RTX A4000 (16 GB, 4x DP: w/o adapter) ; 850W 100/240V AC industrial power supply",null,{"$f":"IF($P$11=6,\"X\",\"\")","v":""}]
[null,null,null,null,null,null,null,null,null,null,null,null,"G","|","|",null,"graphics card NVIDIA RTX A5000 (24 GB, 4x DP: w/o adapter); 850W 100/240V AC industrial power supply",null,{"$f":"IF($P$11=7,\"X\",\"\")","v":""}]
[null,null,null,null,null,null,null,null,null,null,null,null,"H","|","|",null,"graphics card NVIDIA T400 (4 GB, 3x mDP: 3x Adapter mDP to DP); 700W 2x100/240V AC redundant industrial power supply",null,{"$f":"IF($P$11=8,\"X\",\"\")","v":""}]
[null,null,null,null,null,null,null,null,null,null,null,null,"J","|","|",null,"graphics card NVIDIA RTX A2000 (12 GB, 4x mDP: 3x Adapter mDP to DP); 700W 2x100/240V AC redundant industrial power supply",null,{"$f":"IF($P$11=9,\"X\",\"\")","v":""}]
[null,null,null,null,null,null,null,null,null,null,null,null,null,"|","|"]
[null,null,null,null,null,null,null,null,null,null,null,null,null,"|","|",null,"Operating Systems (pre-installed and activated)"]
[null,null,null,null,null,null,null,null,null,null,null,null,null,{"$f":"IF(OR(($P$6=3),($P$6=4),($P$6=7),($P$6=8),($P$6=9)),\"!\",\"A\")","v":"A"},"|",null,"Windows 10 IoT Enterprise 2021 LTSC, Multi Language (En, Ger, Fr, It, Sp), 64 bit; for Core i3 / i5; without USB-Drive (Restore-Image; D&D)",null,{"$f":"IF($P$12=1,\"X\",\"\")","v":""}]
[null,null,null,null,null,null,null,null,null,null,null,null,null,{"$f":"IF(OR(($P$6=1),($P$6=2),($P$6=5),($P$6=6)),\"!\",\"B\")","v":"!"},"|",null,"Windows 10 IoT Enterprise 2021 LTSC, Multi Language (En, Ger, Fr, It, Sp), 64 bit; for Core i7 / i9; without USB-Drive (Restore-Image; D&D)",null,{"$f":"IF($P$12=2,\"X\",\"\")","v":""}]
[null,null,null,null,null,null,null,null,null,null,null,null,null,{"$f":"IF(OR(($P$6=3),($P$6=4),($P$6=7),($P$6=8),($P$6=9)),\"!\",\"C\")","v":"C"},"|",null,"Windows 10 IoT Enterprise 2021 LTSC, Multi Language (En, Ger, Fr, It, Sp), 64 bit; for Core i3 / i5; with USB-Drive (Restore-Image; D&D)",null,{"$f":"IF($P$12=3,\"X\",\"\")","v":""}]
[null,null,null,null,null,null,null,null,null,null,null,null,null,{"$f":"IF(OR(($P$6=1),($P$6=2),($P$6=5),($P$6=6)),\"!\",\"D\")","v":"!"},"|",null,"Windows 10 IoT Enterprise 2021 LTSC, Multi Language (En, Ger, Fr, It, Sp), 64 bit; for Core i7 / i9; with USB-Drive (Restore-Image; D&D)",null,{"$f":"IF($P$12=4,\"X\",\"\")","v":""}]
[null,null,null,null,null,null,null,null,null,null,null,null,null,"X","|",null,"without operating System; without USB-Drive (Restore-Image; D&D)",null,{"$f":"IF($P$12=5,\"X\",\"\")","v":"X"}]
[null,null,null,null,null,null,null,null,null,null,null,null,null,null,"|"]
[null,null,null,null,null,null,null,null,null,null,null,null,null,null,"|",null,"power cord"]
[null,null,null,null,null,null,null,null,null,null,null,null,null,null,0,null,"without power cord;",null,{"$f":"IF($P$13=1,\"X\",\"\")","v":"X"}]
[null,null,null,null,null,null,null,null,null,null,null,null,null,null,1,null,"power cord Europe;",null,{"$f":"IF($P$13=2,\"X\",\"\")","v":""}]
[null,null,null,null,null,null,null,null,null,null,null,null,null,null,2,null,"power cord USA;",null,{"$f":"IF($P$13=3,\"X\",\"\")","v":""}]
[null,null,null,null,null,null,null,null,null,null,null,null,null,null,3,null,"power cord China;",null,{"$f":"IF($P$13=4,\"X\",\"\")","v":""}]
[]
[null,null,null,null,null,null,null,null,null,null,null,null,null,null,null,null," IPC base ",null,"X"]
[]
[{"$f":"A$5","v":"6AG4"},1,0,4,"-",6,{"$f":"G5","v":"A"},{"$f":"H5","v":"A"},{"$f":"I5","v":0},{"$f":"J5","v":0},"-",{"$f":"L5","v":1},{"$f":"M5","v":"A"},{"$f":"N5","v":"X"},{"$f":"O5","v":0},null,null,"Total:"]
[]
[]
["Accessories:"]
[null,null,null,null,null,null,null,null,null,null,null,null,null,null,null,null,"Memory Extension"]
["6ES7648-2AM70-0SA0",null,null,null,null,null,null,null,null,null,null,null,null,null,null,null,"8 GB DDR5 DIMM (1x 8); "]
["6ES7648-2AM80-0SA0",null,null,null,null,null,null,null,null,null,null,null,null,null,null,null,"16 GB DDR5 DIMM (1x 16); "]
["6ES7648-2AM81-0SA0",null,null,null,null,null,null,null,null,null,null,null,null,null,null,null,"32 GB DDR5 DIMM (1x 32); "]
[]
[null,null,null,null,null,null,null,null,null,null,null,null,null,null,null,null,"Hardware accessory"]
["6ES7648-0EH00-1BA0",null,null,null,null,null,null,null,null,null,null,null,null,null,null,null,"removable tray for 3.5\" HDD (SATA/SAS) or 2.5\" SSD (SATA), w/o drive"]
["6ES7648-1AA00-0XK0",null,null,null,null,null,null,null,null,null,null,null,null,null,null,null,"Retainer to interlock the internal USB interface"]
[]
[null,null,null,null,null,null,null,null,null,null,null,null,null,null,null,null,"Mounting accessory"]
["6ES7648-1AA01-0XC0",null,null,null,null,null,null,null,null,null,null,null,null,null,null,null,"Tower Kit for converting the Rack IPC into an Industrial Tower PC  IPC547J/IPC847E/IPC RW-545A/IPC RC-545A"]
[]
[null,null,null,null,null,null,null,null,null,null,null,null,null,null,null,null,"Adapter Cable"]
["6ES7648-3AF00-0XA0",null,null,null,null,null,null,null,null,null,null,null,null,null,null,null,"Adapter cable DisplayPort to DVI-D for onboard graphics"]
["6ES7648-3AG00-0XA0",null,null,null,null,null,null,null,null,null,null,null,null,null,null,null,"Adapter cable DisplayPort to VGA for onboard graphics"]
[]
[null,null,null,null,null,null,null,null,null,null,null,null,null,null,null,null," "]

{"sheet":"IPC547J (Rack)","index":5,"n_rows":125,"n_cols":19,"rows_kept":125,"cut":false,"hidden":false,"merged":[]}
["SIMATIC IPC547J",null,null,null,null,null,null,null,null,null,null,null,null,null,null,null,{"$f":"IF(OR(($G$6=\"!\"),($H$6=\"!\"),($I$6=\"!\"),($J$6=\"!\"),($L$6=\"!\"),($M$6=\"!\"),($N$6=\"!\"),($O$6=\"!\")),\"CONFIGURATION NOT POSSIBLE\",\"\")","v":""}]
[]
[null,null,null,null,null,null,null,null,null,null,null,null,null,null,null,null,{"$f":"IF(E47,F47,\"\")","v":""}]
[null,null,null,null,null,null,null,null,null,null,null,null,null,null,null,null,"Modello superato da RW-545A o RC-545A, tranne in configurazione Windows Server"]
[]
["6AG4",1,0,4,"-",5,{"$f":"IF(P7=1,G21,)&IF(P7=2,G22,)&IF(P7=3,G23,)&IF(P7=4,G24,)&IF(P7=5,G25,)&IF(P7=6,G26,)&IF(P7=7,G27,)&IF(P7=8,G28,)&IF(P7=9,G29,)","v":"C"},{"$f":"IF(P8=1,H32,)&IF(P8=2,H33,)&IF(P8=3,H34,)&IF(P8=4,H35,)&IF(P8=5,H36,)&IF(P8=6,H37,)&IF(P8=7,H38,)&IF(P8=8,H39,)&IF(P8=9,H40,)&IF(P8=10,H41,)&IF(P8=11,H42,)&IF(P8=12,H43,)&IF(P8=13,H44,)&IF(P8=14,H45,)&IF(P8=15,H46,)&IF(P8=16,H47,)","v":"X"},{"$f":"IF(P9=1,I50,IF(P9=2,I51,IF(P9=3,I52,IF(P9=4,I53,IF(P9=5,I54,)))))","v":"0"},{"$f":"IF(P10=1,J57,IF(P10=2,J58,IF(P10=3,J59,IF(P10=4,J60,IF(P10=5,J61,IF(P10=6,J62,IF(P10=7,J63,IF(P10=8,J64,))))))))","v":0},"-",{"$f":"IF(P11=1,L67,IF(P11=2,L68,IF(P11=3,L69,IF(P11=4,L70,IF(P11=5,L71,IF(P11=6,L72,))))))","v":0},{"$f":"IF(P12=1,M75,IF(P12=2,M76,IF(P12=3,M77,IF(P12=4,M78,IF(P12=5,M79,IF(P12=6,M80,IF(P12=7,M81,)))))))","v":"A"},{"$f":"IF(P13=1,N84,IF(P13=2,N85,IF(P13=3,N86,IF(P13=4,N87,IF(P13=5,N88,IF(P13=6,N89,IF(P13=7,N90)))))))","v":"X"},{"$f":"IF(P14=1,O93,IF(P14=2,O94,IF(P14=3,O95,IF(P14=4,O96,IF(P14=5,O97,IF(P14=6,O98,IF(P14=7,O99)))))))","v":0},null,"SIMATIC IPC547J (Rack PC, 19\", 4U)",{"$f":"$A$6&$B$6&$C$6&$D$6&$E$6&$F$6&$G$6&$H$6&$I$6&$J$6&$K$6&$L$6&$M$6&$N$6&$O$6","v":"6AG4104-5CX00-0AX0"}]
[null,null,null,null,null,null,"|","|","|","|",null,"|","|","|","|",1,{"$f":"IF(P7=1,Q21,)&IF(P7=2,Q22,)&IF(P7=3,Q23,)&IF(P7=4,Q24,)&IF(P7=5,Q25,)&IF(P7=6,Q26,)&IF(P7=7,Q27,)&IF(P7=8,Q28,)&IF(P7=9,Q29,)","v":"Core i3-10100E (4C/8T, 3.2 (3.8) GHz, 6 MB Cache) / MB (Chipset H410, 2x Gbit Ethernet, 1x DVI-D, 1x DisplayPort, 4x USB 2.0, 2x USB 3.1 Gen.2, 1x USB 2.0 intern);"}]
[null,null,null,null,null,null,"|","|","|","|",null,"|","|","|","|",16,{"$f":"IF(P8=1,Q32,)&IF(P8=2,Q33,)&IF(P8=3,Q34,)&IF(P8=4,Q35,)&IF(P8=5,Q36,)&IF(P8=6,Q37,)&IF(P8=7,Q38,)&IF(P8=8,Q39,)&IF(P8=9,Q40,)&IF(P8=10,Q41,)&IF(P8=11,Q42,)&IF(P8=12,Q43,)&IF(P8=13,Q44,)&IF(P8=14,Q45,)&IF(P8=15,Q46,)&IF(P8=16,Q47,)","v":"without drives"}]
[null,null,null,null,null,null,"|","|","|","|",null,"|","|","|","|",1,{"$f":"IF(P9=1,Q50,IF(P9=2,Q51,IF(P9=3,Q52,IF(P9=4,Q53,IF(P9=5,Q54)))))","v":"Housing(short) with drive cage type B (for internally mounted / 0,2 g vibration, 2 g shock)blue chromated"}]
[null,null,null,null,null,null,"|","|","|","|",null,"|","|","|","|",1,{"$f":"IF(P10=1,Q57,IF(P10=2,Q58,IF(P10=3,Q59,IF(P10=4,Q60,IF(P10=5,Q61,IF(P10=6,Q62,IF(P10=7,Q63,IF(P10=8,Q64))))))))","v":"100/240V AC industrial power supply, without power cord;"}]
[null,null,null,null,null,null,"|","|","|","|",null,"|","|","|","|",1,{"$f":"IF(P11=1,Q67,IF(P11=2,Q68,IF(P11=3,Q69,IF(P11=4,Q70,IF(P11=5,Q71,IF(P11=6,Q72))))))","v":"4 GB DDR4 SDRAM (1x 4 GB), Single Channel;"}]
[null,null,null,null,null,null,"|","|","|","|",null,"|","|","|","|",1,{"$f":"IF(P12=1,Q75,IF(P12=2,Q76,IF(P12=3,Q77,IF(P12=4,Q78,IF(P12=5,Q79,IF(P12=6,Q80,IF(P12=7,Q81)))))))","v":"without extensions"}]
[null,null,null,null,null,null,"|","|","|","|",null,"|","|","|","|",7,{"$f":"IF(P13=1,Q84,IF(P13=2,Q85,IF(P13=3,Q86,IF(P13=4,Q87,IF(P13=5,Q88,IF(P13=6,Q89,IF(P13=7,Q90)))))))","v":"without operating System"},"Link utili"]
[null,null,null,null,null,null,"|","|","|","|",null,"|","|","|","|",1,{"$f":"IF(P14=1,Q93,IF(P14=2,Q94,IF(P14=3,Q95,IF(P14=4,Q96,IF(P14=5,Q97,IF(P14=6,Q98,IF(P14=7,Q99)))))))","v":"without extensions"},"Certificati"]
[null,null,null,null,null,null,"|","|","|","|",null,"|","|","|","|",null,"Interfaces: 2x USB3.1 Gen1(Type A) frontside; , 1x COM (RS 232, 9-pol); Audio","Datasheet"]
[null,null,null,null,null,null,"|","|","|","|",null,"|","|","|","|",null,"7 expansion slots: 5x PCI-Express, 2x PCI","Manuali"]
[null,null,null,null,null,null,"|","|","|","|",null,"|","|","|","|",null,"Watchdog, Temperature and Fan Control; Board Retainer","CAD 2D/3D"]
[null,null,null,null,null,null,"|","|","|","|",null,"|","|","|","|"]
[null,null,null,null,null,null,"|","|","|","|",null,"|","|","|","|"]
[null,null,null,null,null,null,"|","|","|","|",null,"|","|","|","|",null,"Processor / Board"]
[null,null,null,null,null,null,"C","|","|","|",null,"|","|","|","|",null,"Core i3-10100E (4C/8T, 3.2 (3.8) GHz, 6 MB Cache) / MB (Chipset H410, 2x Gbit Ethernet, 1x DVI-D, 1x DisplayPort, 4x USB 2.0, 2x USB 3.1 Gen.2, 1x USB 2.0 intern);",null,{"$f":"IF($P$7=1,\"X\",\"\")","v":"X"}]
[null,null,null,null,null,null,"D","|","|","|",null,"|","|","|","|",null,"Core i5-10500E (6C/12T, 3.1 (4.2) GHz, 12 MB Cache) / MB (Chipset H410, 2x Gbit Ethernet, 1x DVI-D, 1x DisplayPort, 4x USB 2.0, 2x USB 3.1 Gen.2, 1x USB 2.0 intern);",null,{"$f":"IF($P$7=2,\"X\",\"\")","v":""}]
[null,null,null,null,null,null,"E","|","|","|",null,"|","|","|","|",null,"Core i7-10700E (8C/16T, 2.9 (4.5) GHz, 16 MB Cache) / MB (Chipset H410, 2x Gbit Ethernet, 1x DVI-D, 1x DisplayPort, 4x USB 2.0, 2x USB 3.1 Gen.2, 1x USB 2.0 intern);",null,{"$f":"IF($P$7=3,\"X\",\"\")","v":""}]
[null,null,null,null,null,null,"F","|","|","|",null,"|","|","|","|",null,"Core i9-10900E (10C/20T, 2.8 (4.7) GHz, 20 MB Cache) / MB (Chipset H410, 2x Gbit Ethernet, 1x DVI-D, 1x DisplayPort, 4x USB 2.0, 2x USB 3.1 Gen.2, 1x USB 2.0 intern);",null,{"$f":"IF($P$7=4,\"X\",\"\")","v":""}]
[null,null,null,null,null,null,"G","|","|","|",null,"|","|","|","|",null,"Core i3-10100E (4C/8T, 3.2 (3.8) GHz, 6 MB Cache) / MB (Chipset W480E, 3x Gbit Ethernet, 1x DVI-D, 2x DisplayPort, 6x USB 3.1 Gen.2, 2x USB 2.0 intern, M.2 Slot intern);",null,{"$f":"IF($P$7=5,\"X\",\"\")","v":""}]
[null,null,null,null,null,null,"H","|","|","|",null,"|","|","|","|",null,"Core i5-10500E (6C/12T, 3.1 (4.2) GHz, 12 MB Cache) / MB (Chipset W480E, 3x Gbit Ethernet, 1x DVI-D, 2x DisplayPort, 6x USB 3.1 Gen.2, 2x USB 2.0 intern, M.2 Slot intern);iAMT",null,{"$f":"IF($P$7=6,\"X\",\"\")","v":""}]
[null,null,null,null,null,null,"J","|","|","|",null,"|","|","|","|",null,"Core i7-10700E (8C/16T, 2.9 (4.5) GHz, 16 MB Cache) / MB (Chipset W480E, 3x Gbit Ethernet, 1x DVI-D, 2x DisplayPort, 6x USB 3.1 Gen.2, 2x USB 2.0 intern, M.2 Slot intern);iAMT",null,{"$f":"IF($P$7=7,\"X\",\"\")","v":""}]
[null,null,null,null,null,null,"K","|","|","|",null,"|","|","|","|",null,"Core i9-10900E (10C/20T, 2.8 (4.7) GHz, 20 MB Cache) / MB (Chipset W480E, 3x Gbit Ethernet, 1x DVI-D, 2x DisplayPort, 6x USB 3.1 Gen.2, 2x USB 2.0 intern, M.2 Slot intern);iAMT",null,{"$f":"IF($P$7=8,\"X\",\"\")","v":""}]
[null,null,null,null,null,null,"L","|","|","|",null,"|","|","|","|",null,"Xeon W-1270E (8C/16T, 3.4 (4.8) GHz, 16 MB Cache) / MB (Chipset W480E, 3x Gbit Ethernet, 1x DVI-D, 2x DisplayPort, 6x USB 3.1 Gen.2, 2x USB 2.0 intern, M.2 Slot intern);iAMT",null,{"$f":"IF($P$7=9,\"X\",\"\")","v":""}]
[null,null,null,null,null,null,null,"|","|","|",null,"|","|","|","|"]
[null,null,null,null,null,null,null,"|","|","|",null,"|","|","|","|",null,"Drives"]
[null,null,null,null,null,null,null,"A","|","|",null,"|","|","|","|",null,"1 TB HDD 3.5\" SATA",null,{"$f":"IF($P$8=1,\"X\",\"\")","v":""}]
[null,null,null,null,null,null,null,"B","|","|",null,"|","|","|","|",null,"2x 1 TB HDD 3.5\" SATA",null,{"$f":"IF($P$8=2,\"X\",\"\")","v":""}]
[null,null,null,null,null,null,null,"C","|","|",null,"|","|","|","|",null,"1 TB HDD 3.5\" SATA + 960 GB SSD 2.5\" SATA (for OS, if M.2 SSD does not order)",null,{"$f":"IF($P$8=3,\"X\",\"\")","v":""}]
[null,null,null,null,null,null,null,"D","|","|",null,"|","|","|","|",null,"480 GB SSD 2.5\" SATA",null,{"$f":"IF($P$8=4,\"X\",\"\")","v":""}]
[null,null,null,null,null,null,null,"E","|","|",null,"|","|","|","|",null,"2x 480 GB SSD 2.5\" SATA",null,{"$f":"IF($P$8=5,\"X\",\"\")","v":""}]
[null,null,null,null,null,null,null,"F","|","|",null,"|","|","|","|",null,"960 GB SSD 2.5\" SATA",null,{"$f":"IF($P$8=6,\"X\",\"\")","v":""}]
[null,null,null,null,null,null,null,{"$f":"IF(OR(($P$7=1),($P$7=2),($P$7=3),($P$7=4)),\"!\",\"G\")","v":"!"},"|","|",null,"|","|","|","|",null,"RAID1, 2x 1 TB HDD 3.5\" SATA, [only with W480 Chipset]",null,{"$f":"IF($P$8=7,\"X\",\"\")","v":""}]
[null,null,null,null,null,null,null,{"$f":"IF(OR(($P$7=1),($P$7=2),($P$7=3),($P$7=4)),\"!\",\"H\")","v":"!"},"|","|",null,"|","|","|","|",null,"RAID1, 2x 480 GB SSD 2.5\" SATA, [only with W480 Chipset]",null,{"$f":"IF($P$8=8,\"X\",\"\")","v":""}]
[null,null,null,null,null,null,null,{"$f":"IF(OR(($P$7=1),($P$7=2),($P$7=3),($P$7=4)),\"!\",\"J\")","v":"!"},"|","|",null,"|","|","|","|",null,"RAID1, 2x 960 GB SSD 2.5\" SATA, [only with W480 Chipset]",null,{"$f":"IF($P$8=9,\"X\",\"\")","v":""}]
[null,null,null,null,null,null,null,{"$f":"IF(OR(($P$7=1),($P$7=2),($P$7=3),($P$7=4)),\"!\",\"K\")","v":"!"},"|","|",null,"|","|","|","|",null,"RAID1, 2x 2 TB HDD [Enterprise] 3.5\" SATA , [only with W480 Chipset]",null,{"$f":"IF($P$8=10,\"X\",\"\")","v":""}]
[null,null,null,null,null,null,null,{"$f":"IF(OR(($P$7=1),($P$7=2),($P$7=3),($P$7=4)),\"!\",\"L\")","v":"!"},"|","|",null,"|","|","|","|",null,"RAID1, 2x 4 TB HDD [Enterprise] 3.5\" SATA , [only with W480 Chipset]",null,{"$f":"IF($P$8=11,\"X\",\"\")","v":""}]
[null,null,null,null,null,null,null,{"$f":"IF(OR(($P$7=1),($P$7=2),($P$7=3),($P$7=4)),\"!\",\"M\")","v":"!"},"|","|",null,"|","|","|","|",null,"RAID1, 2x 4 TB HDD [Enterprise] 3.5\" SATA + 4 TB HDD [Enterprise] 3.5\" SATA as HotSpare, [only with W480 Chipset]",null,{"$f":"IF($P$8=12,\"X\",\"\")","v":""}]
[null,null,null,null,null,null,null,{"$f":"IF(OR(($P$7=1),($P$7=2),($P$7=3),($P$7=4)),\"!\",\"N\")","v":"!"},"|","|",null,"|","|","|","|",null,"RAID1, 2x 4 TB HDD [Enterprise] 3.5\" SATA + 960 GB SSD 2.5\" SATA (for OS, if M.2 SSD does not order), [only with W480 Chipset]",null,{"$f":"IF($P$8=13,\"X\",\"\")","v":""}]
[null,null,null,null,null,null,null,{"$f":"IF(OR(($P$7=1),($P$7=2),($P$7=3),($P$7=4)),\"!\",\"P\")","v":"!"},"|","|",null,"|","|","|","|",null,"RAID5, 3x 4 TB HDD [Enterprise] 3.5\" SATA , [only with W480 Chipset]",null,{"$f":"IF($P$8=14,\"X\",\"\")","v":""}]
[null,null,null,null,null,null,null,{"$f":"IF(OR(($P$7=1),($P$7=2),($P$7=3),($P$7=4)),\"!\",\"Q\")","v":"!"},"|","|",null,"|","|","|","|",null,"RAID5, 3x 4 TB HDD [Enterprise] 3.5\" SATA  + 2 TB HDD [Enterprise] 3.5\" SATA as HotSpare, [only with W480 Chipset]",null,{"$f":"IF($P$8=15,\"X\",\"\")","v":""}]
[null,null,null,null,{"$f":"IF(AND(OR(P12=1,P12=2,P12=5,P12=6),OR(P13=1,P13=2,P13=3,P13=4,P13=5,P13=6),P8=16),1,0)","v":0},{"$f":"\"CONFIGURATION NOT POSSIBLE\"&\": \"&\"Operating system is only with HDD/SSD drives available\"","v":"CONFIGURATION NOT POSSIBLE: Operating system is only with HDD/SSD drives available"},null,"X","|","|",null,"|","|","|","|",null,"without drives",null,{"$f":"IF($P$8=16,\"X\",\"\")","v":"X"}]
[null,null,null,null,null,null,null,null,"|","|",null,"|","|","|","|"]
[null,null,null,null,null,null,null,null,"|","|",null,"|","|","|","|",null,"Type of Housing"]
[null,null,null,null,null,null,null,null,{"$f":"IF(OR(($P$8=12),($P$8=13),($P$8=14),($P$8=15)),\"!\",\"0\")","v":"0"},"|",null,"|","|","|","|",null,"Housing(short) with drive cage type B (for internally mounted / 0,2 g vibration, 2 g shock)blue chromated",null,{"$f":"IF($P$9=1,\"X\",\"\")","v":"X"}]
[null,null,null,null,null,null,null,null,{"$f":"IF(OR(($P$8=15)),\"!\",\"1\")","v":"1"},"|",null,"|","|","|","|",null,"Housing with drive cage type B (for internally mounted / 0,5 g vibration, 5 g shock)blue chromated",null,{"$f":"IF($P$9=2,\"X\",\"\")","v":""}]
[null,null,null,null,null,null,null,null,{"$f":"IF(OR(($P$8=15)),\"!\",\"2\")","v":"2"},"|",null,"|","|","|","|",null,"Housing with drive cage type B (for internally mounted / 0,5 g vibration, 5 g shock)painted",null,{"$f":"IF($P$9=3,\"X\",\"\")","v":""}]
[null,null,null,null,null,null,null,null,3,"|",null,"|","|","|","|",null,"Housing with drive cage type A (for frontside mounted removable tray)blue chromated",null,{"$f":"IF($P$9=4,\"X\",\"\")","v":""}]
[null,null,null,null,null,null,null,null,4,"|",null,"|","|","|","|",null,"Housing with drive cage type A (for frontside mounted removable tray)painted",null,{"$f":"IF($P$9=5,\"X\",\"\")","v":""}]
[null,null,null,null,null,null,null,null,null,"|",null,"|","|","|","|"]
[null,null,null,null,null,null,null,null,null,"|",null,"|","|","|","|",null,"Power supplies"]
[null,null,null,null,null,null,null,null,null,0,null,"|","|","|","|",null,"100/240V AC industrial power supply, without power cord;",null,{"$f":"IF($P$10=1,\"X\",\"\")","v":"X"}]
[null,null,null,null,null,null,null,null,null,1,null,"|","|","|","|",null,"100/240V AC industrial power supply, power cord Europe;",null,{"$f":"IF($P$10=2,\"X\",\"\")","v":""}]
[null,null,null,null,null,null,null,null,null,2,null,"|","|","|","|",null,"100/240V AC industrial power supply, power cord USA;",null,{"$f":"IF($P$10=3,\"X\",\"\")","v":""}]
[null,null,null,null,null,null,null,null,null,3,null,"|","|","|","|",null,"100/240V AC industrial power supply, power cord China;",null,{"$f":"IF($P$10=4,\"X\",\"\")","v":""}]
[null,null,null,null,null,null,null,null,null,{"$f":"IF($P$9=1,\"!\",4)","v":"!"},null,"|","|","|","|",null,"2x 100/240V AC redundant industrial power supply, without power cord;",null,{"$f":"IF($P$10=5,\"X\",\"\")","v":""}]
[null,null,null,null,null,null,null,null,null,{"$f":"IF($P$9=1,\"!\",5)","v":"!"},null,"|","|","|","|",null,"2x 100/240V AC redundant industrial power supply, 2x power cord Europe;",null,{"$f":"IF($P$10=6,\"X\",\"\")","v":""}]
[null,null,null,null,null,null,null,null,null,{"$f":"IF($P$9=1,\"!\",6)","v":"!"},null,"|","|","|","|",null,"100/240V AC industrial power supply, 850W, without power cord;",null,{"$f":"IF($P$10=7,\"X\",\"\")","v":""}]
[null,null,null,null,null,null,null,null,null,{"$f":"IF($P$9=1,\"!\",7)","v":"!"},null,"|","|","|","|",null,"100/240V AC industrial power supply, 850W, power cord Europe;",null,{"$f":"IF($P$10=8,\"X\",\"\")","v":""}]
[null,null,null,null,null,null,null,null,null,null,null,"|","|","|","|"]
[null,null,null,null,null,null,null,null,null,null,null,"|","|","|","|",null,"Main Memory"]
[null,null,null,null,null,null,null,null,null,null,null,0,"|","|","|",null,"4 GB DDR4 SDRAM (1x 4 GB), Single Channel;",null,{"$f":"IF($P$11=1,\"X\",\"\")","v":"X"}]
[null,null,null,null,null,null,null,null,null,null,null,1,"|","|","|",null,"8 GB DDR4 SDRAM (2x 4 GB), Dual Channel;",null,{"$f":"IF($P$11=2,\"X\",\"\")","v":""}]
[null,null,null,null,null,null,null,null,null,null,null,2,"|","|","|",null,"16 GB DDR4 SDRAM (2x 8 GB), Dual Channel;",null,{"$f":"IF($P$11=3,\"X\",\"\")","v":""}]
[null,null,null,null,null,null,null,null,null,null,null,3,"|","|","|",null,"32 GB DDR4 SDRAM (2x 16 GB), Dual Channel;",null,{"$f":"IF($P$11=4,\"X\",\"\")","v":""}]
[null,null,null,null,null,null,null,null,null,null,null,4,"|","|","|",null,"64 GB DDR4 SDRAM (2x 32 GB), Dual Channel;",null,{"$f":"IF($P$11=5,\"X\",\"\")","v":""}]
[null,null,null,null,null,null,null,null,null,null,null,{"$f":"IF(OR(($P$7=1),($P$7=2),($P$7=3),($P$7=4)),\"!\",\"5\")","v":"!"},"|","|","|",null,"128 GB DDR4 SDRAM (4x 32 GB), Dual Channel;[only with W480 Chipset]",null,{"$f":"IF($P$11=6,\"X\",\"\")","v":""}]
[null,null,null,null,null,null,null,null,null,null,null,null,"|","|","|"]
[null,null,null,null,null,null,null,null,null,null,null,null,"|","|","|",null,"Extensions (Hardware)"]
[null,null,null,null,null,null,null,null,null,null,null,null,"A","|","|",null,"without extensions",null,{"$f":"IF($P$12=1,\"X\",\"\")","v":"X"}]
[null,null,null,null,null,null,null,null,null,null,null,null,"B","|","|",null,"COM2 port",null,{"$f":"IF($P$12=2,\"X\",\"\")","v":""}]
[null,{"$f":"IF(AND(OR($P$7=7,$P$7=8,$P$7=9,$P$7=10,$P$7=11,$P$7=12,),$P$12=4),1,0)","v":0},"The selected combination is not valid: PCIe x8 RAID controller only with Windows server OS or Windows 7, 64Bit"," .",null,null,null,null,null,null,null,null,{"$f":"IF(OR(($P$7=1),($P$7=2),($P$7=3),($P$7=4)),\"!\",\"C\")","v":"!"},"|","|",null,"512 GB SSD M.2 NVMe (M.2 Slot occupied)(for OS)[only with W480 Chipset]",null,{"$f":"IF($P$12=3,\"X\",\"\")","v":""}]
[null,{"$f":"IF(AND(OR($P$8=17,$P$8=18,$P$8=19,$P$8=20,),$P$12=5),1,0)","v":0},"The selected combination is not valid: PCIe x8 RAID controller only with Windows server OS or Windows 7, 64Bit"," .",null,null,null,null,null,null,null,null,{"$f":"IF(OR(($P$7=1),($P$7=2),($P$7=3),($P$7=4)),\"!\",\"D\")","v":"!"},"|","|",null,"1024 GB SSD M.2 NVMe (M.2 Slot occupied)(for OS)[only with W480 Chipset]",null,{"$f":"IF($P$12=4,\"X\",\"\")","v":""}]
["Inno",null,null,null,null,null,null,null,null,null,null,null,"J","|","|",null,"PCIe x16 graphics card NVIDIA Quadro T400 (3x mDP: 3x adapter mDP to DP), 4 GB (1 Slot occupied)",null,{"$f":"IF($P$12=5,\"X\",\"\")","v":""}]
[null,null,null,null,null,null,null,null,null,null,null,null,{"$f":"IF(OR(($P$10=7),($P$10=8)),\"!\",\"K\")","v":"K"},"|","|",null,"PCIe x16 graphics card NVIDIA Quadro P2200 (4x DP), 5 GB (1 Slot occupied)",null,{"$f":"IF($P$12=6,\"X\",\"\")","v":""}]
[null,null,null,null,null,null,null,null,null,null,null,null,{"$f":"IF(OR(($P$10=1),($P$10=2),($P$10=3),($P$10=4),($P$10=5),($P$10=6)),\"!\",\"L\")","v":"!"},"|","|",null,"PCIe x16 graphics card NVIDIA RTX 4000 (3x DP), 8 GB (1 Slot occupied), [only with 850W PS]",null,{"$f":"IF($P$12=7,\"X\",\"\")","v":""}]
[null,null,null,null,null,null,null,null,null,null,null,null,null,"|","|"]
[null,null,null,null,null,null,null,null,null,null,null,null,null,"|","|",null,"Operating Systems (pre-installed and activated)"]
[null,null,null,null,null,null,null,null,null,null,null,null,null,{"$f":"IF(OR(($P$7=3),($P$7=4),($P$7=7),($P$7=8),($P$7=9)),\"!\",\"A\")","v":"A"},"|",null,"Windows 10 IoT Enterprise 2019 LTSC, Multi Language (En, Ger, Fr, It, Sp), 64 bit;[for processors Core i3 / i5]",null,{"$f":"IF($P$13=1,\"X\",\"\")","v":""}]
[null,null,null,null,null,null,null,null,null,null,null,null,null,{"$f":"IF(OR(($P$7=1),($P$7=2),($P$7=5),($P$7=6)),\"!\",\"B\")","v":"!"},"|",null,"Windows 10 IoT Enterprise 2019 LTSC, Multi Language (En, Ger, Fr, It, Sp), 64 bit;[for processor Core i7 / i9 / Xeon]",null,{"$f":"IF($P$13=2,\"X\",\"\")","v":""}]
["NEW",null,null,null,null,null,null,null,null,null,null,null,null,{"$f":"IF(OR(($P$7=3),($P$7=4),($P$7=7),($P$7=8),($P$7=9)),\"!\",\"C\")","v":"C"},"|",null,"Windows 10 IoT Enterprise 2021 LTSC, Multi Language (En, Ger, Fr, It, Sp), 64 bit;[for processors Core i3 / i5]",null,{"$f":"IF($P$13=3,\"X\",\"\")","v":""}]
["NEW",null,null,null,null,null,null,null,null,null,null,null,null,{"$f":"IF(OR(($P$7=1),($P$7=2),($P$7=5),($P$7=6)),\"!\",\"D\")","v":"!"},"|",null,"Windows 10 IoT Enterprise 2021 LTSC, Multi Language (En, Ger, Fr, It, Sp), 64 bit;[for processor Core i7 / i9 / Xeon]",null,{"$f":"IF($P$13=4,\"X\",\"\")","v":""}]
[null,null,null,null,null,null,null,null,null,null,null,null,null,{"$f":"IF(OR(($P$7=1),($P$7=2),($P$7=3),($P$7=4),($P$7=5),($P$7=6),($P$7=7),($P$7=8)),\"!\",\"N\")","v":"!"},"|",null,"Windows Server 2019 Standard Edition 64 bit, incl. 5 clients multi language (En, Ger, Fr, It, Sp);[only with Xeon]",null,{"$f":"IF($P$13=5,\"X\",\"\")","v":""}]
["NEW",null,null,null,null,null,null,null,null,null,null,null,null,{"$f":"IF(OR(($P$7=1),($P$7=2),($P$7=3),($P$7=4),($P$7=5),($P$7=6),($P$7=7),($P$7=8)),\"!\",\"P\")","v":"!"},"|",null,"Windows Server 2022 Standard Edition 64 bit, incl. 5 clients multi language (En, Ger, Fr, It, Sp);[only with Xeon]",null,{"$f":"IF($P$13=6,\"X\",\"\")","v":""}]
[null,null,null,null,null,null,null,null,null,null,null,null,null,"X","|",null,"without operating System",null,{"$f":"IF($P$13=7,\"X\",\"\")","v":"X"}]
[null,null,null,null,null,null,null,null,null,null,null,null,null,null,"|"]
[null,null,null,null,null,null,null,null,null,null,null,null,null,null,"|",null,"Extensions (Software / Adapter / Security)"]
[null,null,null,null,null,null,null,null,null,null,null,null,null,null,0,null,"without extensions",null,{"$f":"IF($P$14=1,\"X\",\"\")","v":"X"}]
[null,null,null,null,null,null,null,null,null,null,null,null,null,null,1,null,"SIMATIC PC DiagMonitor Software added",null,{"$f":"IF($P$14=2,\"X\",\"\")","v":""}]
[null,null,null,null,null,null,null,null,null,null,null,null,null,null,2,null,"SIMATIC PC Image&Partition Creator Software  added",null,{"$f":"IF($P$14=3,\"X\",\"\")","v":""}]
[null,null,null,null,null,null,null,null,null,null,null,null,null,null,3,null,"SIMATIC PC DiagMonitor  & ImagePartition Creator Software  added",null,{"$f":"IF($P$14=4,\"X\",\"\")","v":""}]
[null,null,null,null,null,null,null,null,null,null,null,null,null,null,4,null,"adapter cable DP to VGA for onboard graphics",null,{"$f":"IF($P$14=5,\"X\",\"\")","v":""}]
[null,null,null,null,null,null,null,null,null,null,null,null,null,null,5,null,"adapter cable DP to DVI-D for onboard graphics",null,{"$f":"IF($P$14=6,\"X\",\"\")","v":""}]
[null,null,null,null,null,null,null,null,null,null,null,null,null,null,8,null,"TPM 2.0",null,{"$f":"IF($P$14=7,\"X\",\"\")","v":""}]
[]
[null,null,null,null,null,null,null,null,null,null,null,null,null,null,null,null," IPC base ",null,"X"]
[]
[{"$f":"A$6","v":"6AG4"},1,0,4,"-",5,{"$f":"G6","v":"C"},{"$f":"H6","v":"X"},{"$f":"I6","v":"0"},{"$f":"J6","v":0},"-",{"$f":"L6","v":0},{"$f":"M6","v":"A"},{"$f":"N6","v":"X"},{"$f":"O6","v":0},null,null,"Total:"]
[]
[]
["Accessories:"]
[null,null,null,null,null,null,null,null,null,null,null,null,null,null,null,null,"Memory Extension"]
["6ES7648-2AL60-0QA0",null,null,null,null,null,null,null,null,null,null,null,null,null,null,null,"4 GB DDR4 DIMM (1x 4); "]
["6ES7648-2AL70-0QA0",null,null,null,null,null,null,null,null,null,null,null,null,null,null,null,"8 GB DDR4 DIMM (1x 8); "]
["6ES7648-2AL80-0QA0",null,null,null,null,null,null,null,null,null,null,null,null,null,null,null,"16 GB DDR4 DIMM (1x 16); "]
["6ES7648-2AL81-0QA0",null,null,null,null,null,null,null,null,null,null,null,null,null,null,null,"32 GB DDR4 DIMM (1x 32); "]
[]
[null,null,null,null,null,null,null,null,null,null,null,null,null,null,null,null,"Hardware accessory"]
["6ES7648-0EH00-1BA0",null,null,null,null,null,null,null,null,null,null,null,null,null,null,null,"removable tray for 3.5\" HDD (SATA/SAS) or 2.5\" SSD (SATA), w/o drive"]
["6ES7648-1AA00-0XK0",null,null,null,null,null,null,null,null,null,null,null,null,null,null,null,"Retainer to interlock the internal USB interface"]
[]
[null,null,null,null,null,null,null,null,null,null,null,null,null,null,null,null,"Mounting accessory"]
["6ES7648-1AA01-0XC0",null,null,null,null,null,null,null,null,null,null,null,null,null,null,null,"Tower Kit for converting the Rack IPC into an Industrial Tower PC  IPC547J/IPC847E/IPC RW-545A/IPC RC-545A"]
["6ES7648-1AA01-0XE0",null,null,null,null,null,null,null,null,null,null,null,null,null,null,null,"Tower Kit for converting the Rack IPC into an Industrial Tower PC for IPC547J/IPC RC-545A (short enclosure)"]
[]
[null,null,null,null,null,null,null,null,null,null,null,null,null,null,null,null,"Adapter Cable"]
["6ES7648-3AF00-0XA0",null,null,null,null,null,null,null,null,null,null,null,null,null,null,null,"Adapter cable DisplayPort to DVI-D for onboard graphics"]
["6ES7648-3AG00-0XA0",null,null,null,null,null,null,null,null,null,null,null,null,null,null,null,"Adapter cable DisplayPort to VGA for onboard graphics"]
[]
[null,null,null,null,null,null,null,null,null,null,null,null,null,null,null,null," "]

{"sheet":"IPC647E (Rack)","index":6,"n_rows":129,"n_cols":19,"rows_kept":129,"cut":false,"hidden":false,"merged":[]}
["SIMATIC IPC647E",null,null,null,null,null,null,null,null,null,null,null,null,null,null,null,{"$f":"IF(OR(($G$5=\"!\"),($H$5=\"!\"),($I$5=\"!\"),($J$5=\"!\"),($L$5=\"!\"),($M$5=\"!\"),($N$5=\"!\"),($O$5=\"!\")),\"CONFIGURATION NOT POSSIBLE\",\"\")","v":""}]
[null,null,null,null,null,null,null,null,null,null,null,null,null,null,null,null,{"$f":"IF(B77,C77,\"\")","v":""}]
[null,null,null,null,null,null,null,null,null,null,null,null,null,null,null,null,{"$f":"IF(E51,F51,\"\")","v":""}]
[null,null,null,null,null,null,null,null,null,null,null,null,null,null,null,null,""]
["6AG4",1,1,2,"-",3,{"$f":"IF(P6=1,G21,)&IF(P6=2,G22,)&IF(P6=3,G23,)&IF(P6=4,G24,)&IF(P6=5,G25,)&IF(P6=6,G26,)&IF(P6=7,G27,)&IF(P6=8,G28,)&IF(P6=9,G29,)&IF(P6=10,G30,)&IF(P6=11,G31,)&IF(P6=12,G32,)&IF(P6=13,G33,)&IF(P6=14,G34,)&IF(P6=15,G35,)","v":"A"},{"$f":"IF(P7=1,H38,)&IF(P7=2,H39,)&IF(P7=3,H40,)&IF(P7=4,H41,)&IF(P7=5,H42,)&IF(P7=6,H43,)&IF(P7=7,H44,)&IF(P7=8,H45,)&IF(P7=9,H46,)&IF(P7=10,H47,)&IF(P7=11,H48,)&IF(P7=12,H49,)&IF(P7=13,H50,)&IF(P7=14,H51,)","v":"X"},{"$f":"IF(P8=1,I54,IF(P8=2,I55,IF(P8=3,I56,IF(P8=4,I57,IF(P8=5,I58,IF(P8=6,I59,IF(P8=7,I60,IF(P8=8,I61))))))))","v":"0"},{"$f":"IF(P9=1,J64,IF(P9=2,J65,IF(P9=3,J66,IF(P9=4,J67,IF(P9=5,J68,IF(P9=6,J69,IF(P9=7,J70,IF(P9=8,J71,IF(P9=9,J72)))))))))","v":0},"-",{"$f":"IF(P10=1,L75,IF(P10=2,L76,IF(P10=3,L77,IF(P10=4,L78,IF(P10=5,L79,IF(P10=6,L80,IF(P10=7,L81)))))))","v":0},{"$f":"IF(P11=1,M84,IF(P11=2,M85,IF(P11=3,M86,IF(P11=4,M87,IF(P11=5,M88,IF(P11=6,M89,IF(P11=7,M90,IF(P11=8,M91,IF(P11=9,M92,IF(P11=10,M93))))))))))","v":"X"},{"$f":"IF(P12=1,N96,IF(P12=2,N97,IF(P12=3,N98,IF(P12=4,N99,IF(P12=5,N100,IF(P12=6,N101,IF(P12=7,N102)))))))","v":"X"},{"$f":"IF(P13=1,O106,IF(P13=2,O107,IF(P13=3,O108,IF(P13=4,O109))))","v":0},null,"SIMATIC IPC647E (Rack PC, 19\", 2U)",{"$f":"$A$5&$B$5&$C$5&$D$5&$E$5&$F$5&$G$5&$H$5&$I$5&$J$5&$K$5&$L$5&$M$5&$N$5&$O$5","v":"6AG4112-3AX00-0XX0"}]
[{"$f":"IF(P6=9,Q29)","v":false},null,null,null,null,null,"|","|","|","|",null,"|","|","|","|",1,{"$f":"IF(P6=1,Q21,)&IF(P6=2,Q22,)&IF(P6=3,Q23,)&IF(P6=4,Q24,)&IF(P6=5,Q25,)&IF(P6=6,Q26,)&IF(P6=7,Q27,)&IF(P6=8,Q28,)&IF(P6=9,Q29,)&IF(P6=10,Q30,)&IF(P6=11,Q31,)&IF(P6=12,Q32,)&IF(P6=13,Q33,)&IF(P6=14,Q34,)&IF(P6=15,Q35,)","v":"Core i3-8100 (4C/4T, 3.6 GHz, 6 MB Cache); Board 2 Slots: 1x PCIe x16 (16 L), 1x PCIe x16 (4 L);"}]
[null,null,null,null,null,null,"|","|","|","|",null,"|","|","|","|",14,{"$f":"IF(P7=1,Q38,)&IF(P7=2,Q39,)&IF(P7=3,Q40,)&IF(P7=4,Q41,)&IF(P7=5,Q42,)&IF(P7=6,Q43,)&IF(P7=7,Q44,)&IF(P7=8,Q45,)&IF(P7=9,Q46,)&IF(P7=10,Q47,)&IF(P7=11,Q48,)&IF(P7=12,Q49,)&IF(P7=13,Q50,)&IF(P7=14,Q51,)","v":"without drives"}]
[null,null,null,null,null,null,"|","|","|","|",null,"|","|","|","|",1,{"$f":"IF(P8=1,Q54,IF(P8=2,Q55,IF(P8=3,Q56,IF(P8=4,Q57,IF(P8=5,Q58,IF(P8=6,Q59,IF(P8=7,Q60,IF(P8=8,Q61))))))))","v":"Housing with drive cage type B (for internally mounted / 0,5 g vibration, 5 g shock); 100/240V AC industrial power supply"}]
[null,null,null,null,null,null,"|","|","|","|",null,"|","|","|","|",1,{"$f":"IF(P9=1,Q64,IF(P9=2,Q65,IF(P9=3,Q66,IF(P9=4,Q67,IF(P9=5,Q68,IF(P9=6,Q69,IF(P9=7,Q70,IF(P9=8,Q71,IF(P9=9,Q72)))))))))","v":"4 GB DDR4 SDRAM (1x 4 GB), Single Channel;"}]
[null,null,null,null,null,null,"|","|","|","|",null,"|","|","|","|",1,{"$f":"IF(P10=1,Q75,IF(P10=2,Q76,IF(P10=3,Q77,IF(P10=4,Q78,IF(P10=5,Q79,IF(P10=6,Q80,IF(P10=7,Q81)))))))","v":"without extensions"}]
[null,null,null,null,null,null,"|","|","|","|",null,"|","|","|","|",10,{"$f":"IF(P11=1,Q84,IF(P11=2,Q85,IF(P11=3,Q86,IF(P11=4,Q87,IF(P11=5,Q88,IF(P11=6,Q89,IF(P11=7,Q90,IF(P11=8,Q91,IF(P11=9,Q92,IF(P11=10,Q93))))))))))","v":"without operating System"}]
[null,null,null,null,null,null,"|","|","|","|",null,"|","|","|","|",6,{"$f":"IF(P12=1,Q96,IF(P12=2,Q97,IF(P12=3,Q98,IF(P12=4,Q99,IF(P12=5,Q100,IF(P12=6,Q101,IF(P12=7,Q102)))))))","v":"without extensions"}]
[null,null,null,null,null,null,"|","|","|","|",null,"|","|","|","|",1,{"$f":"IF(P13=1,Q106,IF(P13=2,Q107,IF(P13=3,Q108,IF(P13=4,Q109,IF(P13=5,#REF!,IF(P13=6,#REF!,IF(P13=7,#REF!,IF(P13=8,#REF!,IF(P13=9,#REF!)))))))))","v":"without power cord;"},"Link utili"]
[null,null,null,null,null,null,"|","|","|","|",null,"|","|","|","|",null,"Interfaces: 3x Gigabit/s Ethernet (IE/PN, RJ45); M.2 PCIe x4 (Key M) Slot internal;","Certificati"]
[null,null,null,null,null,null,"|","|","|","|",null,"|","|","|","|",null,"1x DVI-D; 2x DisplayPort; 1x COM (RS 232, 9-pol); audio","Datasheet"]
[null,null,null,null,null,null,"|","|","|","|",null,"|","|","|","|",null,"4x USB3.1 Gen2(Type A), 2x USB3.1 Gen2(Type C) backside; 2x USB3.1 Gen1(Type A) frontside; 1x USB3.1 Gen2(Type A) internal;","Manuale"]
[null,null,null,null,null,null,"|","|","|","|",null,"|","|","|","|",null,"Watchdog, Temperature and Fan Control; Board Retainer","CAD 2D/3D"]
[null,null,null,null,null,null,"|","|","|","|",null,"|","|","|","|",null,{"$f":"IF(L5=\"!\",\"A2 GPU not with options: Board 2 Slots: 1x PCIe x16 (16 L), 1x PCIe x16 (4 L);RAID1, 2x 2 TB HDD [Enterprise] 3.5'' SAS;Housing with drive cage type B (for internally mounted / 0,5 g vibration, 5 g shock)\",\"\")","v":""}]
[null,null,null,null,null,null,"|","|","|","|",null,"|","|","|","|",null,{"$f":"IF(L5=\"!\",\"A2 GPU not with options:Windows 10 Enterprise 2016 LTSB, Multi Language (En, Ger, Fr, It, Sp), 64 bit;Windows Server 2016 Standard Edition 64 bit, incl. 5 clients multi language (En, Ger, Fr, It, Sp);\",\"\")","v":""}]
[null,null,null,null,null,null,"|","|","|","|",null,"|","|","|","|",null,"Processor / Board"]
[null,null,null,null,null,null,"A","|","|","|",null,"|","|","|","|",null,"Core i3-8100 (4C/4T, 3.6 GHz, 6 MB Cache); Board 2 Slots: 1x PCIe x16 (16 L), 1x PCIe x16 (4 L);",null,{"$f":"IF($P$6=1,\"X\",\"\")","v":"X"}]
[null,null,null,null,null,null,"B","|","|","|",null,"|","|","|","|",null,"Core i3-8100 (4C/4T, 3.6 GHz, 6 MB Cache); Board 4 Slots: 2x PCI, 2x PCIe x16 (8 L);",null,{"$f":"IF($P$6=2,\"X\",\"\")","v":""}]
[null,null,null,null,null,null,"C","|","|","|",null,"|","|","|","|",null,"Core i3-8100 (4C/4T, 3.6 GHz, 6 MB Cache); Board 4 Slots: 2x PCIe x16 (8 L), 1x PCIe x16 (4 L), 1x PCIe x16 (1 L);",null,{"$f":"IF($P$6=3,\"X\",\"\")","v":""}]
[null,null,null,null,null,null,"D","|","|","|",null,"|","|","|","|",null,"Core i5-8500 (6C/6T, 3.0 (4.1) GHz, 9 MB Cache, TB, AMT); Board 2 Slots: 1x PCIe x16 (16 L), 1x PCIe x16 (4 L);",null,{"$f":"IF($P$6=4,\"X\",\"\")","v":""}]
[null,null,null,null,null,null,"E","|","|","|",null,"|","|","|","|",null,"Core i5-8500 (6C/6T, 3.0 (4.1) GHz, 9 MB Cache, TB, AMT); Board 4 Slots: 2x PCI, 2x PCIe x16 (8 L);",null,{"$f":"IF($P$6=5,\"X\",\"\")","v":""}]
[null,null,null,null,null,null,"F","|","|","|",null,"|","|","|","|",null,"Core i5-8500 (6C/6T, 3.0 (4.1) GHz, 9 MB Cache, TB, AMT); Board 4 Slots: 2x PCIe x16 (8 L), 1x PCIe x16 (4 L), 1x PCIe x16 (1 L);",null,{"$f":"IF($P$6=6,\"X\",\"\")","v":""}]
[null,null,null,null,null,null,"G","|","|","|",null,"|","|","|","|",null,"Core i7-8700 (6C/12T, 3.2 (4.6) GHz, 12 MB Cache, TB, AMT); Board 2 Slots: 1x PCIe x16 (16 L), 1x PCIe x16 (4 L);",null,{"$f":"IF($P$6=7,\"X\",\"\")","v":""}]
[null,null,null,null,null,null,"H","|","|","|",null,"|","|","|","|",null,"Core i7-8700 (6C/12T, 3.2 (4.6) GHz, 12 MB Cache, TB, AMT); Board 4 Slots: 2x PCI, 2x PCIe x16 (8 L);",null,{"$f":"IF($P$6=8,\"X\",\"\")","v":""}]
[null,null,null,null,null,null,"J","|","|","|",null,"|","|","|","|",null,"Core i7-8700 (6C/12T, 3.2 (4.6) GHz, 12 MB Cache, TB, AMT); Board 4 Slots: 2x PCIe x16 (8 L), 1x PCIe x16 (4 L), 1x PCIe x16 (1 L);",null,{"$f":"IF($P$6=9,\"X\",\"\")","v":""}]
[null,null,null,null,null,null,"K","|","|","|",null,"|","|","|","|",null,"Xeon E-2176G (6C/12T, 3.7 (4.7) GHz, 12 MB Cache, TB, AMT); Board 2 Slots: 1x PCIe x16 (16 L), 1x PCIe x16 (4 L);",null,{"$f":"IF($P$6=10,\"X\",\"\")","v":""}]
[null,null,null,null,null,null,"L","|","|","|",null,"|","|","|","|",null,"Xeon E-2176G (6C/12T, 3.7 (4.7) GHz, 12 MB Cache, TB, AMT); Board 4 Slots: 2x PCI, 2x PCIe x16 (8 L);",null,{"$f":"IF($P$6=11,\"X\",\"\")","v":""}]
[null,null,null,null,null,null,"M","|","|","|",null,"|","|","|","|",null,"Xeon E-2176G (6C/12T, 3.7 (4.7) GHz, 12 MB Cache, TB, AMT); Board 4 Slots: 2x PCIe x16 (8 L), 1x PCIe x16 (4 L), 1x PCIe x16 (1 L);",null,{"$f":"IF($P$6=12,\"X\",\"\")","v":""}]
[null,null,null,null,null,null,"N","|","|","|",null,"|","|","|","|",null,"Xeon E-2278GE (8C/16T, 3.3 (4.7) GHz, 16 MB Cache, TB, AMT); Board 2 Slots: 1x PCIe x16 (16 L), 1x PCIe x16 (4 L);",null,{"$f":"IF($P$6=13,\"X\",\"\")","v":""}]
[null,null,null,null,null,null,"Q","|","|","|",null,"|","|","|","|",null,"Xeon E-2278GE (8C/16T, 3.3 (4.7) GHz, 16 MB Cache, TB, AMT); Board 4 Slots: 2x PCI, 2x PCIe x16 (8 L);",null,{"$f":"IF($P$6=14,\"X\",\"\")","v":""}]
[null,null,null,null,null,null,"R","|","|","|",null,"|","|","|","|",null,"Xeon E-2278GE (8C/16T, 3.3 (4.7) GHz, 16 MB Cache, TB, AMT); Board 4 Slots: 2x PCIe x16 (8 L), 1x PCIe x16 (4 L), 1x PCIe x16 (1 L);",null,{"$f":"IF($P$6=15,\"X\",\"\")","v":""}]
[null,null,null,null,null,null,null,"|","|","|",null,"|","|","|","|"]
[null,null,null,null,null,null,null,"|","|","|",null,"|","|","|","|",null,"Drives"]
[null,null,null,null,null,null,null,"A","|","|",null,"|","|","|","|",null,"1 TB HDD 3.5\" SATA",null,{"$f":"IF($P$7=1,\"X\",\"\")","v":""}]
[null,null,null,null,null,null,null,"B","|","|",null,"|","|","|","|",null,"2x 1 TB HDD 3.5\" SATA",null,{"$f":"IF($P$7=2,\"X\",\"\")","v":""}]
[null,null,null,null,null,null,null,"C","|","|",null,"|","|","|","|",null,"RAID1, 2x 1 TB HDD 3.5\" SATA",null,{"$f":"IF($P$7=3,\"X\",\"\")","v":""}]
[null,null,null,null,null,null,null,"D","|","|",null,"|","|","|","|",null,"RAID1, 2x 2 TB HDD [Enterprise] 3.5\" SATA ",null,{"$f":"IF($P$7=4,\"X\",\"\")","v":""}]
[null,null,null,null,null,null,null,"E","|","|",null,"|","|","|","|",null,"RAID1, 2x 4 TB HDD [Enterprise] 3.5\" SATA ",null,{"$f":"IF($P$7=5,\"X\",\"\")","v":""}]
[null,null,null,null,null,null,null,"K","|","|",null,"|","|","|","|",null,"RAID1, 2x 2 TB HDD [Enterprise] 3.5\" SAS; PCIe x8 RAID controller incl. ZMCP-Modul (1 Slot occupied)",null,{"$f":"IF($P$7=6,\"X\",\"\")","v":""}]
[null,null,null,null,null,null,null,"L","|","|",null,"|","|","|","|",null,"RAID1, 2x 2 TB HDD [Enterprise] 3.5\" SAS; PCIe x8 RAID controller incl. ZMCP-Modul (1 Slot occupied) + 480 GB SSD 2.5\" SATA internally mounted",null,{"$f":"IF($P$7=7,\"X\",\"\")","v":""}]
[null,null,null,null,null,null,null,"P","|","|",null,"|","|","|","|",null,"1 TB HDD 3.5\" SATA + 480 GB SSD 2.5\" SATA (for OS, if M.2 SSD does not order)",null,{"$f":"IF($P$7=8,\"X\",\"\")","v":""}]
[null,null,null,null,null,null,null,"Q","|","|",null,"|","|","|","|",null,"480 GB SSD 2.5\" SATA",null,{"$f":"IF($P$7=9,\"X\",\"\")","v":""}]
[null,null,null,null,null,null,null,"R","|","|",null,"|","|","|","|",null,"960 GB SSD 2.5\" SATA",null,{"$f":"IF($P$7=10,\"X\",\"\")","v":""}]
[null,null,null,null,null,null,null,"S","|","|",null,"|","|","|","|",null,"2x 480 GB SSD 2.5\" SATA",null,{"$f":"IF($P$7=11,\"X\",\"\")","v":""}]
[null,null,null,null,null,null,null,"T","|","|",null,"|","|","|","|",null,"RAID1, 2x 480 GB SSD 2.5\" SATA",null,{"$f":"IF($P$7=12,\"X\",\"\")","v":""}]
["NEW",null,null,null,null,null,null,"U","|","|",null,"|","|","|","|",null,"RAID1, 2x 960 GB SSD 2.5\" SATA",null,{"$f":"IF($P$7=13,\"X\",\"\")","v":""}]
[null,null,null,null,{"$f":"IF(AND(OR(P11=1,P11=2,P11=3,P11=4,P11=5,P11=6,P11=7,P11=8,P11=9),OR(P10=1,P10=2,P10=6),P7=14),1,0)","v":0},{"$f":"\"CONFIGURATION NOT POSSIBLE\"&\":\"&\"Operating system is only with HDD/SSD drives available\"","v":"CONFIGURATION NOT POSSIBLE:Operating system is only with HDD/SSD drives available"},null,"X","|","|",null,"|","|","|","|",null,"without drives",null,{"$f":"IF($P$7=14,\"X\",\"\")","v":"X"}]
[null,null,null,null,null,null,null,null,"|","|",null,"|","|","|","|"]
[null,null,null,null,null,null,null,null,"|","|",null,"|","|","|","|",null,"Type of Housing, power supplies"]
[null,null,null,null,null,null,null,null,{"$f":"IF(OR(($P$7=6),($P$7=7)),\"!\",\"0\")","v":"0"},"|",null,"|","|","|","|",null,"Housing with drive cage type B (for internally mounted / 0,5 g vibration, 5 g shock); 100/240V AC industrial power supply",null,{"$f":"IF($P$8=1,\"X\",\"\")","v":"X"}]
[null,null,null,null,null,null,null,null,1,"|",null,"|","|","|","|",null,"Housing with drive cage type A (for frontside mounted removable tray); 100/240V AC industrial power supply",null,{"$f":"IF($P$8=2,\"X\",\"\")","v":""}]
[null,null,null,null,null,null,null,null,{"$f":"IF(OR(($P$7=6),($P$7=7)),\"!\",\"2\")","v":"2"},"|",null,"|","|","|","|",null,"Housing with drive cage type B (for internally mounted / 0,5 g vibration, 5 g shock); 2x 100/240V AC redundant industrial power supply",null,{"$f":"IF($P$8=3,\"X\",\"\")","v":""}]
[null,null,null,null,null,null,null,null,3,"|",null,"|","|","|","|",null,"Housing with drive cage type A (for frontside mounted removable tray); 2x 100/240V AC redundant industrial power supply",null,{"$f":"IF($P$8=4,\"X\",\"\")","v":""}]
[null,null,null,null,null,null,null,null,{"$f":"IF(OR(($P$7=6),($P$7=7)),\"!\",\"4\")","v":"4"},"|",null,"|","|","|","|",null,"Housing with drive cage type B (for internally mounted / 0,5 g vibration, 5 g shock) + COM2 port; 100/240V AC industrial power supply",null,{"$f":"IF($P$8=5,\"X\",\"\")","v":""}]
[null,null,null,null,null,null,null,null,5,"|",null,"|","|","|","|",null,"Housing with drive cage type A (for frontside mounted removable tray) + COM2 port; 100/240V AC industrial power supply",null,{"$f":"IF($P$8=6,\"X\",\"\")","v":""}]
[null,null,null,null,null,null,null,null,{"$f":"IF(OR(($P$7=6),($P$7=7)),\"!\",\"6\")","v":"6"},"|",null,"|","|","|","|",null,"Housing with drive cage type B (for internally mounted / 0,5 g vibration, 5 g shock) + COM2 port; 2x 100/240V AC redundant industrial power supply",null,{"$f":"IF($P$8=7,\"X\",\"\")","v":""}]
[null,null,null,null,null,null,null,null,7,"|",null,"|","|","|","|",null,"Housing with drive cage type A (for frontside mounted removable tray) + COM2 port; 2x 100/240V AC redundant industrial power supply",null,{"$f":"IF($P$8=8,\"X\",\"\")","v":""}]
[null,null,null,null,null,null,null,null,null,"|",null,"|","|","|","|"]
[null,null,null,null,null,null,null,null,null,"|",null,"|","|","|","|",null,"Main Memory"]
[null,null,null,null,null,null,null,null,null,0,null,"|","|","|","|",null,"4 GB DDR4 SDRAM (1x 4 GB), Single Channel;",null,{"$f":"IF($P$9=1,\"X\",\"\")","v":"X"}]
[null,null,null,null,null,null,null,null,null,1,null,"|","|","|","|",null,"8 GB DDR4 SDRAM (2x 4 GB), Dual Channel;",null,{"$f":"IF($P$9=2,\"X\",\"\")","v":""}]
[null,null,null,null,null,null,null,null,null,2,null,"|","|","|","|",null,"16 GB DDR4 SDRAM (2x 8 GB), Dual Channel;",null,{"$f":"IF($P$9=3,\"X\",\"\")","v":""}]
[null,null,null,null,null,null,null,null,null,3,null,"|","|","|","|",null,"32 GB DDR4 SDRAM (2x 16 GB), Dual Channel;",null,{"$f":"IF($P$9=4,\"X\",\"\")","v":""}]
[null,null,null,null,null,null,null,null,null,4,null,"|","|","|","|",null,"64 GB DDR4 SDRAM (4x 16 GB), Dual Channel;",null,{"$f":"IF($P$9=5,\"X\",\"\")","v":""}]
[null,null,null,null,null,null,null,null,null,5,null,"|","|","|","|",null,"128 GB DDR4 SDRAM (4x 32 GB), Dual Channel;",null,{"$f":"IF($P$9=6,\"X\",\"\")","v":""}]
[null,null,null,null,null,null,null,null,null,{"$f":"IF(OR(($P$6=4),($P$6=5),($P$6=6),($P$6=7),($P$6=8),($P$6=9)),\"!\",\"6\")","v":"6"},null,"|","|","|","|",null,"16 GB DDR4 SDRAM (2x 8 GB), Dual Channel; ECC [only with Core i3 / Xeon]",null,{"$f":"IF($P$9=7,\"X\",\"\")","v":""}]
[null,null,null,null,null,null,null,null,null,{"$f":"IF(OR(($P$6=4),($P$6=5),($P$6=6),($P$6=7),($P$6=8),($P$6=9)),\"!\",\"7\")","v":"7"},null,"|","|","|","|",null,"32 GB DDR4 SDRAM (2x 16 GB), Dual Channel; ECC [only with Core i3 / Xeon]",null,{"$f":"IF($P$9=8,\"X\",\"\")","v":""}]
[null,null,null,null,null,null,null,null,null,{"$f":"IF(OR(($P$6=4),($P$6=5),($P$6=6),($P$6=7),($P$6=8),($P$6=9)),\"!\",\"8\")","v":"8"},null,"|","|","|","|",null,"64 GB DDR4 SDRAM (4x 16 GB), Dual Channel; ECC [only with Core i3 / Xeon]",null,{"$f":"IF($P$9=9,\"X\",\"\")","v":""}]
[null,null,null,null,null,null,null,null,null,null,null,"|","|","|","|"]
[null,null,null,null,null,null,null,null,null,null,null,"|","|","|","|",null,"Extensions (Hardware)"]
[null,null,null,null,null,null,null,null,null,null,null,0,"|","|","|",null,"without extensions",null,{"$f":"IF($P$10=1,\"X\",\"\")","v":"X"}]
[null,null,null,null,null,null,null,null,null,null,null,2,"|","|","|",null,"PCIe x16 graphics card NVIDIA T400 (3x mDP: 3x adapter mDP to DP), 4 GB (1 Slot occupied)",null,{"$f":"IF($P$10=2,\"X\",\"\")","v":""}]
[null,{"$f":"IF(AND(OR($P$7=17,$P$7=18,$P$7=19,$P$7=20),OR($P$9=1,$P$9=3),$P$10=5),1,0)","v":0},"The selected combination is not valid: PCIe x8 RAID controller not with 7 PCI slots board and graphics card",".",null,null,null,null,null,null,null,4,"|","|","|",null,"512 GB SSD M.2 NVMe (M.2 Slot occupied) (for OS)",null,{"$f":"IF($P$10=3,\"X\",\"\")","v":""}]
[null,null,null,null,null,null,null,null,null,null,null,5,"|","|","|",null,"512 GB SSD M.2 NVMe (M.2 Slot occupied) (for OS) + PCIe x16 graphics card NVIDIA T400 (3x mDP: 3x adapter mDP to DP), 4 GB (1 Slot occupied)",null,{"$f":"IF($P$10=4,\"X\",\"\")","v":""}]
[null,null,null,null,null,null,null,null,null,null,null,6,"|","|","|",null,"1024 GB SSD M.2 NVMe (M.2 Slot occupied) (for OS)",null,{"$f":"IF($P$10=5,\"X\",\"\")","v":""}]
[null,null,null,null,null,null,null,null,null,null,null,{"$f":"IF(OR(($P$6=1),($P$6=4),($P$6=7),($P$6=10),($P$6=13),($P$7=6),($P$7=7),($P$8=1),($P$8=3),($P$8=5),($P$8=7),($P$11=1),($P$11=2),($P$11=7)),\"!\",\"7\")","v":"!"},"|","|","|",null,"PCIe x8 GPU card NVIDIA A2 Tensor Core, 16 GB (2 Slot occupied)",null,{"$f":"IF($P$10=6,\"X\",\"\")","v":""}]
["NEW",null,null,null,null,null,null,null,null,null,null,{"$f":"IF(OR(($P$6=1),($P$6=4),($P$6=7),($P$6=10),($P$6=13),($P$7=6),($P$7=7),($P$8=1),($P$8=3),($P$8=5),($P$8=7),($P$11=1),($P$11=2),($P$11=7)),\"!\",\"8\")","v":"!"},"|","|","|",null,"512 GB SSD M.2 NVMe (M.2 Slot occupied) (for OS) + PCIe x8 GPU card NVIDIA A2 Tensor Core, 16 GB (2 Slot occupied)",null,{"$f":"IF($P$10=7,\"X\",\"\")","v":""}]
[null,null,null,null,null,null,null,null,null,null,null,null,"|","|","|"]
[null,null,null,null,null,null,null,null,null,null,null,null,"|","|","|",null,"Operating Systems (pre-installed and activated)"]
[null,null,null," .",null,null,null,null,null,null,null,null,{"$f":"IF(OR(($P$6=7),($P$6=8),($P$6=9),($P$6=10),($P$6=11),($P$6=12),($P$6=13),($P$6=14),($P$6=15)),\"!\",\"A\")","v":"A"},"|","|",null,"Windows 10 Enterprise 2016 LTSB, Multi Language (En, Ger, Fr, It, Sp), 64 bit;[for processors Core i3 / Core i5]",null,{"$f":"IF($P$11=1,\"X\",\"\")","v":""}]
[null,null,null," .",null,null,null,null,null,null,null,null,{"$f":"IF(OR(($P$6=1),($P$6=2),($P$6=3),($P$6=4),($P$6=5),($P$6=6),($P$6=13),($P$6=14),($P$6=15)),\"!\",\"B\")","v":"!"},"|","|",null,"Windows 10 Enterprise 2016 LTSB, Multi Language (En, Ger, Fr, It, Sp), 64 bit;[for processor Core i7 / Xeon]",null,{"$f":"IF($P$11=2,\"X\",\"\")","v":""}]
[null,{"$f":"IF(AND(OR($P$6=7,$P$6=8,$P$6=9,$P$6=10,$P$6=11,$P$6=12,),$P$11=4),1,0)","v":0},"The selected combination is not valid: PCIe x8 RAID controller only with Windows server OS or Windows 7, 64Bit"," .",null,null,null,null,null,null,null,null,{"$f":"IF(OR(($P$6=7),($P$6=8),($P$6=9),($P$6=10),($P$6=11),($P$6=12),($P$6=13),($P$6=14),($P$6=15)),\"!\",\"C\")","v":"C"},"|","|",null,"Windows 10 IoT Enterprise 2019 LTSC, Multi Language (En, Ger, Fr, It, Sp), 64 bit;[for processors Core i3 / Core i5]",null,{"$f":"IF($P$11=3,\"X\",\"\")","v":""}]
[null,{"$f":"IF(AND(OR($P$7=17,$P$7=18,$P$7=19,$P$7=20,),$P$11=5),1,0)","v":0},"The selected combination is not valid: PCIe x8 RAID controller only with Windows server OS or Windows 7, 64Bit"," .",null,null,null,null,null,null,null,null,{"$f":"IF(OR(($P$6=1),($P$6=2),($P$6=3),($P$6=4),($P$6=5),($P$6=6)),\"!\",\"D\")","v":"!"},"|","|",null,"Windows 10 IoT Enterprise 2019 LTSC, Multi Language (En, Ger, Fr, It, Sp), 64 bit;[for processor Core i7 / Xeon]",null,{"$f":"IF($P$11=4,\"X\",\"\")","v":""}]
[null,{"$f":"IF(AND(OR($P$6=7,$P$6=8,$P$6=9,$P$6=10,$P$6=11,$P$6=12,),$P$11=4),1,0)","v":0},"The selected combination is not valid: PCIe x8 RAID controller only with Windows server OS or Windows 7, 64Bit"," .",null,null,null,null,null,null,null,null,{"$f":"IF(OR(($P$6=7),($P$6=8),($P$6=9),($P$6=10),($P$6=11),($P$6=12),($P$6=13),($P$6=14),($P$6=15)),\"!\",\"E\")","v":"E"},"|","|",null,"Windows 10 IoT Enterprise 2021 LTSC, Multi Language (En, Ger, Fr, It, Sp), 64 bit;[for processors Core i3 / Core i5]",null,{"$f":"IF($P$11=5,\"X\",\"\")","v":""}]
[null,{"$f":"IF(AND(OR($P$7=17,$P$7=18,$P$7=19,$P$7=20,),$P$11=5),1,0)","v":0},"The selected combination is not valid: PCIe x8 RAID controller only with Windows server OS or Windows 7, 64Bit"," .",null,null,null,null,null,null,null,null,{"$f":"IF(OR(($P$6=1),($P$6=2),($P$6=3),($P$6=4),($P$6=5),($P$6=6)),\"!\",\"F\")","v":"!"},"|","|",null,"Windows 10 IoT Enterprise 2021 LTSC, Multi Language (En, Ger, Fr, It, Sp), 64 bit;[for processor Core i7 / Xeon]",null,{"$f":"IF($P$11=6,\"X\",\"\")","v":""}]
[null,null,null,null,null,null,null,null,null,null,null,null,{"$f":"IF(OR(($P$6=13),($P$6=14),($P$6=15)),\"!\",\"H\")","v":"H"},"|","|",null,"Windows Server 2016 Standard Edition 64 bit, incl. 5 clients multi language (En, Ger, Fr, It, Sp);",null,{"$f":"IF($P$11=7,\"X\",\"\")","v":""}]
[null,null,null,null,null,null,null,null,null,null,null,null,"J","|","|",null,"Windows Server 2019 Standard Edition 64 bit, incl. 5 clients multi language (En, Ger, Fr, It, Sp);",null,{"$f":"IF($P$11=8,\"X\",\"\")","v":""}]
[null,null,null,null,null,null,null,null,null,null,null,null,"K","|","|",null,"Windows Server 2022 Standard Edition 64 bit, incl. 5 clients multi language (En, Ger, Fr, It, Sp);",null,{"$f":"IF($P$11=9,\"X\",\"\")","v":""}]
[null,null,null,null,null,null,null,null,null,null,null,null,"X","|","|",null,"without operating System",null,{"$f":"IF($P$11=10,\"X\",\"\")","v":"X"}]
[null,null,null,null,null,null,null,null,null,null,null,null,null,"|","|"]
[null,null,null,null,null,null,null,null,null,null,null,null,null,"|","|",null,"Extensions (Software / Adapter / Security)"]
[null,null,null,null,null,null,null,null,null,null,null,null,null,"A","|",null,"SIMATIC PC DiagMonitor Software added",null,{"$f":"IF($P$12=1,\"X\",\"\")","v":""}]
[null,null,null,null,null,null,null,null,null,null,null,null,null,"B","|",null,"SIMATIC PC Image&Partition Creator Software  added",null,{"$f":"IF($P$12=2,\"X\",\"\")","v":""}]
[null,null,null,null,null,null,null,null,null,null,null,null,null,"C","|",null,"SIMATIC PC DiagMonitor  & ImagePartition Creator Software  added",null,{"$f":"IF($P$12=3,\"X\",\"\")","v":""}]
[null,null,null,null,null,null,null,null,null,null,null,null,null,"H","|",null,"adapter cable DP to VGA for onboard graphics",null,{"$f":"IF($P$12=4,\"X\",\"\")","v":""}]
[null,null,null,null,null,null,null,null,null,null,null,null,null,"J","|",null,"adapter cable DP to DVI-D for onboard graphics",null,{"$f":"IF($P$12=5,\"X\",\"\")","v":""}]
[null,null,null,null,null,null,null,null,null,null,null,null,null,"X","|",null,"without extensions",null,{"$f":"IF($P$12=6,\"X\",\"\")","v":"X"}]
[null,null,null,null,null,null,null,null,null,null,null,null,null,"Y","|",null,"TPM 2.0",null,{"$f":"IF($P$12=7,\"X\",\"\")","v":""}]
[null,null,null,null,null,null,null,null,null,null,null,null,null,null,"|"]
[null,null,null,null,null,null,null,null,null,null,null,null,null,null,"|"]
[null,null,null,null,null,null,null,null,null,null,null,null,null,null,"|",null,"Country-specific types"]
[null,null,null,null,null,null,null,null,null,null,null,null,null,null,0,null,"without power cord;",null,{"$f":"IF($P$13=1,\"X\",\"\")","v":"X"}]
[null,null,null,null,null,null,null,null,null,null,null,null,null,null,1,null,"power cord Europe;",null,{"$f":"IF($P$13=2,\"X\",\"\")","v":""}]
[null,null,null,null,null,null,null,null,null,null,null,null,null,null,2,null,"power cord USA;",null,{"$f":"IF($P$13=3,\"X\",\"\")","v":""}]
[null,null,null,null,null,null,null,null,null,null,null,null,null,null,3,null,"power cord China;",null,{"$f":"IF($P$13=4,\"X\",\"\")","v":""}]
[]
[null,null,null,null,null,null,null,null,null,null,null,null,null,null,null,null," IPC base ",null,"X"]
[]
[{"$f":"A$5","v":"6AG4"},1,1,2,"-",3,{"$f":"G5","v":"A"},{"$f":"H5","v":"X"},{"$f":"I5","v":"0"},{"$f":"J5","v":0},"-",{"$f":"L5","v":0},{"$f":"M5","v":"X"},{"$f":"N5","v":"X"},{"$f":"O5","v":0},null,null,"Total:"]
[]
[]
["Accessories:"]
[null,null,null,null,null,null,null,null,null,null,null,null,null,null,null,null,"Memory Extension"]
["6ES7648-2AL60-0QA0",null,null,null,null,null,null,null,null,null,null,null,null,null,null,null,"4 GB DDR4 DIMM (1x 4); "]
["6ES7648-2AL70-0QA0",null,null,null,null,null,null,null,null,null,null,null,null,null,null,null,"8 GB DDR4 DIMM (1x 8); "]
["6ES7648-2AL80-0QA0",null,null,null,null,null,null,null,null,null,null,null,null,null,null,null,"16 GB DDR4 DIMM (1x 16); "]
["6ES7648-2AL81-0QA0",null,null,null,null,null,null,null,null,null,null,null,null,null,null,null,"32 GB DDR4 DIMM (1x 32); "]
[]
[null,null,null,null,null,null,null,null,null,null,null,null,null,null,null,null,"HW Accessory"]
["6ES7648-0EH00-1BA0",null,null,null,null,null,null,null,null,null,null,null,null,null,null,null,"Tray for low-profile removable frame for 3.5\" HDD (SATA/SAS) and 2.5\" SSD (SATA), w/o drive"]
["6ES7648-1AA00-0XK0",null,null,null,null,null,null,null,null,null,null,null,null,null,null,null,"Retainer to interlock the internal USB interface"]
[]
[null,null,null,null,null,null,null,null,null,null,null,null,null,null,null,null,"Adapter Cable"]
["6ES7648-3AF00-0XA0",null,null,null,null,null,null,null,null,null,null,null,null,null,null,null,"Adapter cable DisplayPort to DVI-D"]
["6ES7648-3AG00-0XA0",null,null,null,null,null,null,null,null,null,null,null,null,null,null,null,"Adapter cable DisplayPort to VGA"]

{"sheet":"IPC847E (Rack)","index":7,"n_rows":142,"n_cols":19,"rows_kept":142,"cut":false,"hidden":false,"merged":[]}
["SIMATIC IPC847E",null,null,null,null,null,null,null,null,null,null,null,null,null,null,null,{"$f":"IF(OR(($G$5=\"!\"),($H$5=\"!\"),($I$5=\"!\"),($J$5=\"!\"),($L$5=\"!\"),($M$5=\"!\"),($N$5=\"!\"),($O$5=\"!\")),\"CONFIGURATION NOT POSSIBLE\",\"\")","v":""}]
[null,null,null,null,null,null,null,null,null,null,null,null,null,null,null,null,{"$f":"IF(L5=\"*\",\"CONFIGURATION NOT POSSIBLE\"&\": \"&\"only\"&\"Board 11 Slots\",\"\")","v":""}]
[null,null,null,null,null,null,null,null,null,null,null,null,null,null,null,null,{"$f":"IF(E56,F56,\"\")","v":""}]
[null,null,null,null,null,null,null,null,null,null,null,null,null,null,null,null,{"$f":"IF(I5=\"!\",\"CONFIGURATION NOT POSSIBLE\"&\" :\"&\" only \"&\" Housing with drive cage type A\",\"\")","v":""}]
["6AG4",1,1,4,"-",3,{"$f":"IF(P6=1,G21,)&IF(P6=2,G22,)&IF(P6=3,G23,)&IF(P6=4,G24,)&IF(P6=5,G25,)&IF(P6=6,G26,)&IF(P6=7,G27,)&IF(P6=8,G28,)&IF(P6=9,G29,)&IF(P6=10,G30,)&IF(P6=11,G31,)&IF(P6=12,G32,)&IF(P6=13,G33,)&IF(P6=14,G34,)&IF(P6=15,G35,)","v":"A"},{"$f":"IF(P7=1,H38,)&IF(P7=2,H39,)&IF(P7=3,H40,)&IF(P7=4,H41,)&IF(P7=5,H42,)&IF(P7=6,H43,)&IF(P7=7,H44,)&IF(P7=8,H45,)&IF(P7=9,H46,)&IF(P7=10,H47,)&IF(P7=11,H48,)&IF(P7=12,H49,)&IF(P7=13,H50,)&IF(P7=14,H51,)&IF(P7=15,H52,)&IF(P7=16,H53,)&IF(P7=17,H54,)&IF(P7=18,H55,)&IF(P7=19,H56,)","v":"X"},{"$f":"IF(P8=1,I59,IF(P8=2,I60,IF(P8=3,I61,IF(P8=4,I62,IF(P8=5,I63,IF(P8=6,I64,IF(P8=7,I65,IF(P8=8,I66,IF(P8=9,I67)))))))))","v":"0"},{"$f":"IF(P9=1,J70,IF(P9=2,J71,IF(P9=3,J72,IF(P9=4,J73,IF(P9=5,J74,IF(P9=6,J75,IF(P9=7,J76,IF(P9=8,J77,IF(P9=9,J78)))))))))","v":0},"-",{"$f":"IF(P10=1,L81,IF(P10=2,L82,IF(P10=3,L83,IF(P10=4,L84,IF(P10=5,L85,IF(P10=6,L86,IF(P10=7,L87,IF(P10=8,L88))))))))","v":0},{"$f":"IF(P11=1,M91,IF(P11=2,M92,IF(P11=3,M93,IF(P11=4,M94,IF(P11=5,M95,IF(P11=6,M96,IF(P11=7,M97,IF(P11=8,M98,IF(P11=9,M99,IF(P11=10,M100))))))))))","v":"X"},{"$f":"IF(P12=1,N103,IF(P12=2,N104,IF(P12=3,N105,IF(P12=4,N106,IF(P12=5,N107,IF(P12=6,N108,IF(P12=7,N109)))))))","v":"X"},{"$f":"IF(P13=1,O113,IF(P13=2,O114,IF(P13=3,O115,IF(P13=4,O116))))","v":0},null,"SIMATIC IPC847E (Rack PC, 19\", 4U)",{"$f":"$A$5&$B$5&$C$5&$D$5&$E$5&$F$5&$G$5&$H$5&$I$5&$J$5&$K$5&$L$5&$M$5&$N$5&$O$5","v":"6AG4114-3AX00-0XX0"}]
[null,null,null,null,null,null,"|","|","|","|",null,"|","|","|","|",1,{"$f":"IF(P6=1,Q21,)&IF(P6=2,Q22,)&IF(P6=3,Q23,)&IF(P6=4,Q24,)&IF(P6=5,Q25,)&IF(P6=6,Q26,)&IF(P6=7,Q27,)&IF(P6=8,Q28,)&IF(P6=9,Q29,)&IF(P6=10,Q30,)&IF(P6=11,Q31,)&IF(P6=12,Q32,)&IF(P6=13,Q33,)&IF(P6=14,Q34,)&IF(P6=15,Q35,)","v":"Core i3-8100 (4C/4T, 3.6 GHz, 6 MB Cache); Board 9 Slots: 7x PCI, 2x PCIe x16 (8 L);"}]
[null,null,null,null,null,null,"|","|","|","|",null,"|","|","|","|",19,{"$f":"IF(P7=1,Q38,)&IF(P7=2,Q39,)&IF(P7=3,Q40,)&IF(P7=4,Q41,)&IF(P7=5,Q42,)&IF(P7=6,Q43,)&IF(P7=7,Q44,)&IF(P7=8,Q45,)&IF(P7=9,Q46,)&IF(P7=10,Q47,)&IF(P7=11,Q48,)&IF(P7=12,Q49,)&IF(P7=13,Q50,)&IF(P7=14,Q51,)&IF(P7=15,Q52,)&IF(P7=16,Q53,)&IF(P7=17,Q54,)&IF(P7=18,Q55,)&IF(P7=19,Q56,)","v":"without drives"}]
[null,null,null,null,null,null,"|","|","|","|",null,"|","|","|","|",1,{"$f":"IF(P8=1,Q59,IF(P8=2,Q60,IF(P8=3,Q61,IF(P8=4,Q62,IF(P8=5,Q63,IF(P8=6,Q64,IF(P8=7,Q65,IF(P8=8,Q66,IF(P8=9,Q67)))))))))","v":"Housing with drive cage type B (for internally mounted / 0,5 g vibration, 5 g shock); 100/240V AC industrial power supply"}]
[null,null,null,null,null,null,"|","|","|","|",null,"|","|","|","|",1,{"$f":"IF(P9=1,Q70,IF(P9=2,Q71,IF(P9=3,Q72,IF(P9=4,Q73,IF(P9=5,Q74,IF(P9=6,Q75,IF(P9=7,Q76,IF(P9=8,Q77,IF(P9=9,Q78)))))))))","v":"4 GB DDR4 SDRAM (1x 4 GB), Single Channel;"}]
[null,null,null,null,null,null,"|","|","|","|",null,"|","|","|","|",1,{"$f":"IF(P10=1,Q81,IF(P10=2,Q82,IF(P10=3,Q83,IF(P10=4,Q84,IF(P10=5,Q85,IF(P10=6,Q86,IF(P10=7,Q87,IF(P10=8,Q88))))))))","v":"without extensions"}]
[null,null,null,null,null,null,"|","|","|","|",null,"|","|","|","|",10,{"$f":"IF(P11=1,Q91,IF(P11=2,Q92,IF(P11=3,Q93,IF(P11=4,Q94,IF(P11=5,Q95,IF(P11=6,Q96,IF(P11=7,Q97,IF(P11=8,Q98,IF(P11=9,Q99,IF(P11=10,Q100))))))))))","v":"without operating System"}]
[null,null,null,null,null,null,"|","|","|","|",null,"|","|","|","|",6,{"$f":"IF(P12=1,Q103,IF(P12=2,Q104,IF(P12=3,Q105,IF(P12=4,Q106,IF(P12=5,Q107,IF(P12=6,Q108,IF(P12=7,Q109)))))))","v":"without extensions"}]
[null,null,null,null,null,null,"|","|","|","|",null,"|","|","|","|",1,{"$f":"IF(P13=1,Q113,IF(P13=2,Q114,IF(P13=3,Q115,IF(P13=4,Q116,IF(P13=5,#REF!,IF(P13=6,#REF!,IF(P13=7,#REF!,IF(P13=8,#REF!,IF(P13=9,#REF!)))))))))","v":"without power cord;"},"Link utili"]
[null,null,null,null,null,null,"|","|","|","|",null,"|","|","|","|",null,"Interfaces: 3x Gigabit/s Ethernet (IE/PN, RJ45);","Certificati"]
[null,null,null,null,null,null,"|","|","|","|",null,"|","|","|","|",null,"1x DVI-D; 2x DisplayPort; 1x COM (RS 232, 9-pol); audio","Datasheet"]
[null,null,null,null,null,null,"|","|","|","|",null,"|","|","|","|",null,"4x USB3.1 Gen2(Type A), 2x USB3.1 Gen2(Type C) backside; 2x USB3.1 Gen1(Type A) frontside; 1x USB3.1 Gen2(Type A) internal;","Manuale"]
[null,null,null,null,null,null,"|","|","|","|",null,"|","|","|","|",null,"Watchdog, Temperature and Fan Control; Board Retainer","CAD 2D/3D"]
[null,null,null,null,null,null,"|","|","|","|",null,"|","|","|","|"]
[null,null,null,null,null,null,"|","|","|","|",null,"|","|","|","|"]
[null,null,null,null,null,null,"|","|","|","|",null,"|","|","|","|",null,"Processor / Board"]
[null,null,null,null,null,null,"A","|","|","|",null,"|","|","|","|",null,"Core i3-8100 (4C/4T, 3.6 GHz, 6 MB Cache); Board 9 Slots: 7x PCI, 2x PCIe x16 (8 L);",null,{"$f":"IF($P$6=1,\"X\",\"\")","v":"X"}]
[null,null,null,null,null,null,"B","|","|","|",null,"|","|","|","|",null,"Core i3-8100 (4C/4T, 3.6 GHz, 6 MB Cache); Board 11 Slots: 3x PCI, 1x PCIe x16 (8 L), 5x PCIe x16 (4 L), 2x PCIe x4 (4 L);",null,{"$f":"IF($P$6=2,\"X\",\"\")","v":""}]
[null,null,null,null,null,null,"C","|","|","|",null,"|","|","|","|",null,"Core i3-8100 (4C/4T, 3.6 GHz, 6 MB Cache); Board 11 Slots: 3x PCI, 1x PCIe x16 (16 L), 3x PCIe x16 (4 L), 2x PCIe x16 (1 L), 2x PCIe x4 (4 L); ",null,{"$f":"IF($P$6=3,\"X\",\"\")","v":""}]
[null,null,null,null,null,null,"D","|","|","|",null,"|","|","|","|",null,"Core i5-8500 (6C/6T, 3.0 (4.1) GHz, 9 MB Cache, TB, AMT); Board 9 Slots: 7x PCI, 2x PCIe x16 (8 L);",null,{"$f":"IF($P$6=4,\"X\",\"\")","v":""}]
[null,null,null,null,null,null,"E","|","|","|",null,"|","|","|","|",null,"Core i5-8500 (6C/6T, 3.0 (4.1) GHz, 9 MB Cache, TB, AMT); Board 11 Slots: 3x PCI, 1x PCIe x16 (8 L), 5x PCIe x16 (4 L), 2x PCIe x4 (4 L);",null,{"$f":"IF($P$6=5,\"X\",\"\")","v":""}]
[null,null,null,null,null,null,"F","|","|","|",null,"|","|","|","|",null,"Core i5-8500 (6C/6T, 3.0 (4.1) GHz, 9 MB Cache, TB, AMT); Board 11 Slots: 3x PCI, 1x PCIe x16 (16 L), 3x PCIe x16 (4 L), 2x PCIe x16 (1 L), 2x PCIe x4 (4 L); ",null,{"$f":"IF($P$6=6,\"X\",\"\")","v":""}]
[null,null,null,null,null,null,"G","|","|","|",null,"|","|","|","|",null,"Core i7-8700 (6C/12T, 3.2 (4.6) GHz, 12 MB Cache, TB, AMT); Board 9 Slots: 7x PCI, 2x PCIe x16 (8 L);",null,{"$f":"IF($P$6=7,\"X\",\"\")","v":""}]
[null,null,null,null,null,null,"H","|","|","|",null,"|","|","|","|",null,"Core i7-8700 (6C/12T, 3.2 (4.6) GHz, 12 MB Cache, TB, AMT); Board 11 Slots: 3x PCI, 1x PCIe x16 (8 L), 5x PCIe x16 (4 L), 2x PCIe x4 (4 L);",null,{"$f":"IF($P$6=8,\"X\",\"\")","v":""}]
[null,null,null,null,null,null,"J","|","|","|",null,"|","|","|","|",null,"Core i7-8700 (6C/12T, 3.2 (4.6) GHz, 12 MB Cache, TB, AMT); Board 11 Slots: 3x PCI, 1x PCIe x16 (16 L), 3x PCIe x16 (4 L), 2x PCIe x16 (1 L), 2x PCIe x4 (4 L); ",null,{"$f":"IF($P$6=9,\"X\",\"\")","v":""}]
[null,null,null,null,null,null,"K","|","|","|",null,"|","|","|","|",null,"Xeon E-2176G (6C/12T, 3.7 (4.7) GHz, 12 MB Cache, TB, AMT); Board 9 Slots: 7x PCI, 2x PCIe x16 (8 L);",null,{"$f":"IF($P$6=10,\"X\",\"\")","v":""}]
[null,null,null,null,null,null,"L","|","|","|",null,"|","|","|","|",null,"Xeon E-2176G (6C/12T, 3.7 (4.7) GHz, 12 MB Cache, TB, AMT); Board 11 Slots: 3x PCI, 1x PCIe x16 (8 L), 5x PCIe x16 (4 L), 2x PCIe x4 (4 L);",null,{"$f":"IF($P$6=11,\"X\",\"\")","v":""}]
[null,null,null,null,null,null,"M","|","|","|",null,"|","|","|","|",null,"Xeon E-2176G (6C/12T, 3.7 (4.7) GHz, 12 MB Cache, TB, AMT); Board 11 Slots: 3x PCI, 1x PCIe x16 (16 L), 3x PCIe x16 (4 L), 2x PCIe x16 (1 L), 2x PCIe x4 (4 L); ",null,{"$f":"IF($P$6=12,\"X\",\"\")","v":""}]
[null,null,null,null,null,null,"N","|","|","|",null,"|","|","|","|",null,"Xeon E-2278GE (8C/16T, 3.3 (4.7) GHz, 16 MB Cache, TB, AMT); Board 9 Slots: 7x PCI, 2x PCIe x16 (8 L);",null,{"$f":"IF($P$6=13,\"X\",\"\")","v":""}]
[null,null,null,null,null,null,"Q","|","|","|",null,"|","|","|","|",null,"Xeon E-2278GE (8C/16T, 3.3 (4.7) GHz, 16 MB Cache, TB, AMT); Board 11 Slots: 3x PCI, 1x PCIe x16 (8 L), 5x PCIe x16 (4 L), 2x PCIe x4 (4 L);",null,{"$f":"IF($P$6=14,\"X\",\"\")","v":""}]
[null,null,null,null,null,null,"R","|","|","|",null,"|","|","|","|",null,"Xeon E-2278GE (8C/16T, 3.3 (4.7) GHz, 16 MB Cache, TB, AMT); Board 11 Slots: 3x PCI, 1x PCIe x16 (16 L), 3x PCIe x16 (4 L), 2x PCIe x16 (1 L), 2x PCIe x4 (4 L); ",null,{"$f":"IF($P$6=15,\"X\",\"\")","v":""}]
[null,null,null,null,null,null,null,"|","|","|",null,"|","|","|","|"]
[null,null,null,null,null,null,null,"|","|","|",null,"|","|","|","|",null,"Drives"]
[null,null,null,null,null,null,null,"A","|","|",null,"|","|","|","|",null,"1 TB HDD 3.5\" SATA",null,{"$f":"IF($P$7=1,\"X\",\"\")","v":""}]
[null,null,null,null,null,null,null,"B","|","|",null,"|","|","|","|",null,"2x 1 TB HDD 3.5\" SATA",null,{"$f":"IF($P$7=2,\"X\",\"\")","v":""}]
[null,null,null,null,null,null,null,"C","|","|",null,"|","|","|","|",null,"RAID1, 2x 1 TB HDD 3.5\" SATA",null,{"$f":"IF($P$7=3,\"X\",\"\")","v":""}]
[null,null,null,null,null,null,null,"D","|","|",null,"|","|","|","|",null,"RAID1, 2x 2 TB HDD [Enterprise] 3.5\" SATA ",null,{"$f":"IF($P$7=4,\"X\",\"\")","v":""}]
[null,null,null,null,null,null,null,"E","|","|",null,"|","|","|","|",null,"RAID1, 2x 4 TB HDD [Enterprise] 3.5\" SATA ",null,{"$f":"IF($P$7=5,\"X\",\"\")","v":""}]
[null,null,null,null,null,null,null,"F","|","|",null,"|","|","|","|",null,"RAID1, 2x 4 TB HDD [Enterprise] 3.5\" SATA + 4 TB HDD [Enterprise] 3.5\" SATA as HotSpare",null,{"$f":"IF($P$7=6,\"X\",\"\")","v":""}]
[null,null,null,null,null,null,null,"G","|","|",null,"|","|","|","|",null,"RAID1, 2x 4 TB HDD [Enterprise] 3.5\" SATA + 480 GB SSD 2.5\" SATA (for OS, if M.2 SSD does not order)",null,{"$f":"IF($P$7=7,\"X\",\"\")","v":""}]
[null,null,null,null,null,null,null,"H","|","|",null,"|","|","|","|",null,"RAID5, 3x 4 TB HDD [Enterprise] 3.5\" SATA ",null,{"$f":"IF($P$7=8,\"X\",\"\")","v":""}]
[null,null,null,null,null,null,null,"J","|","|",null,"|","|","|","|",null,"RAID5, 3x 4 TB HDD [Enterprise] 3.5\" SATA  + 4 TB HDD [Enterprise] 3.5\" SATA as HotSpare",null,{"$f":"IF($P$7=9,\"X\",\"\")","v":""}]
[null,null,null,null,null,null,null,"K","|","|",null,"|","|","|","|",null,"RAID1, 2x 2 TB HDD [Enterprise] 3.5\" SAS; PCIe x8 RAID controller incl. ZMCP-Modul (1 Slot occupied)",null,{"$f":"IF($P$7=10,\"X\",\"\")","v":""}]
[null,null,null,null,null,null,null,"L","|","|",null,"|","|","|","|",null,"RAID1, 2x 2 TB HDD [Enterprise] 3.5\" SAS; PCIe x8 RAID controller incl. ZMCP-Modul (1 Slot occupied) + 480 GB SSD 2.5\" SATA",null,{"$f":"IF($P$7=11,\"X\",\"\")","v":""}]
[null,null,null,null,null,null,null,"M","|","|",null,"|","|","|","|",null,"RAID5, 3x 2 TB HDD [Enterprise] 3.5\" SAS; PCIe x8 RAID controller incl. ZMCP-Modul (1 Slot occupied)",null,{"$f":"IF($P$7=12,\"X\",\"\")","v":""}]
[null,null,null,null,null,null,null,"N","|","|",null,"|","|","|","|",null,"RAID5, 3x 2 TB HDD [Enterprise] 3.5\" SAS  + 2 TB HDD [Enterprise] 3.5\" SAS as HotSpare; PCIe x8 RAID controller incl. ZMCP-Modul (1 Slot occupied)",null,{"$f":"IF($P$7=13,\"X\",\"\")","v":""}]
[null,null,null,null,null,null,null,"P","|","|",null,"|","|","|","|",null,"1 TB HDD 3.5\" SATA + 480 GB SSD 2.5\" SATA (for OS, if M.2 SSD does not order)",null,{"$f":"IF($P$7=14,\"X\",\"\")","v":""}]
[null,null,null,null,null,null,null,"Q","|","|",null,"|","|","|","|",null,"480 GB SSD 2.5\" SATA",null,{"$f":"IF($P$7=15,\"X\",\"\")","v":""}]
[null,null,null,null,null,null,null,"R","|","|",null,"|","|","|","|",null,"960 GB SSD 2.5\" SATA",null,{"$f":"IF($P$7=16,\"X\",\"\")","v":""}]
[null,null,null,null,null,null,null,"S","|","|",null,"|","|","|","|",null,"2x 480 GB SSD 2.5\" SATA",null,{"$f":"IF($P$7=17,\"X\",\"\")","v":""}]
[null,null,null,null,null,null,null,"T","|","|",null,"|","|","|","|",null,"RAID1, 2x 480 GB SSD 2.5\" SATA",null,{"$f":"IF($P$7=18,\"X\",\"\")","v":""}]
[null,null,null,null,{"$f":"IF(AND(OR(P11=1,P11=2,P11=3,P11=4,P11=5,P11=6,P11=7,P11=8,P11=9),OR(P10=1,P10=2,P10=3,P10=4,P10=8),P7=19),1,0)","v":0},{"$f":"\"CONFIGURATION NOT POSSIBLE\"&\": \"&\"Operating system is only with HDD/SSD drives available\"","v":"CONFIGURATION NOT POSSIBLE: Operating system is only with HDD/SSD drives available"},null,"X","|","|",null,"|","|","|","|",null,"without drives",null,{"$f":"IF($P$7=19,\"X\",\"\")","v":"X"}]
[null,null,null,null,null,null,null,null,"|","|",null,"|","|","|","|"]
[null,null,null,null,null,null,null,null,"|","|",null,"|","|","|","|",null,"Type of Housing, power supplies"]
[null,null,null,null,null,null,null,null,{"$f":"IF(OR(($P$7=9),($P$7=10),($P$7=11),($P$7=12),($P$7=13)),\"!\",\"0\")","v":"0"},"|",null,"|","|","|","|",null,"Housing with drive cage type B (for internally mounted / 0,5 g vibration, 5 g shock); 100/240V AC industrial power supply",null,{"$f":"IF($P$8=1,\"X\",\"\")","v":"X"}]
[null,null,null,null,null,null,null,null,1,"|",null,"|","|","|","|",null,"Housing with drive cage type A (for frontside mounted removable tray); 100/240V AC industrial power supply",null,{"$f":"IF($P$8=2,\"X\",\"\")","v":""}]
[null,null,null,null,null,null,null,null,{"$f":"IF(OR(($P$7=9),($P$7=10),($P$7=11),($P$7=12),($P$7=13)),\"!\",\"2\")","v":"2"},"|",null,"|","|","|","|",null,"Housing with drive cage type B (for internally mounted / 0,5 g vibration, 5 g shock); 2x 100/240V AC redundant industrial power supply",null,{"$f":"IF($P$8=3,\"X\",\"\")","v":""}]
[null,null,null,null,null,null,null,null,3,"|",null,"|","|","|","|",null,"Housing with drive cage type A (for frontside mounted removable tray); 2x 100/240V AC redundant industrial power supply",null,{"$f":"IF($P$8=4,\"X\",\"\")","v":""}]
[null,null,null,null,null,null,null,null,{"$f":"IF(OR(($P$7=9),($P$7=10),($P$7=11),($P$7=12),($P$7=13)),\"!\",\"4\")","v":"4"},"|",null,"|","|","|","|",null,"Housing with drive cage type B (for internally mounted / 0,5 g vibration, 5 g shock) + COM2 port; 100/240V AC industrial power supply",null,{"$f":"IF($P$8=5,\"X\",\"\")","v":""}]
[null,null,null,null,null,null,null,null,5,"|",null,"|","|","|","|",null,"Housing with drive cage type A (for frontside mounted removable tray) + COM2 port; 100/240V AC industrial power supply",null,{"$f":"IF($P$8=6,\"X\",\"\")","v":""}]
[null,null,null,null,null,null,null,null,{"$f":"IF(OR(($P$7=9),($P$7=10),($P$7=11),($P$7=12),($P$7=13)),\"!\",\"6\")","v":"6"},"|",null,"|","|","|","|",null,"Housing with drive cage type B (for internally mounted / 0,5 g vibration, 5 g shock) + COM2 port; 2x 100/240V AC redundant industrial power supply",null,{"$f":"IF($P$8=7,\"X\",\"\")","v":""}]
[null,null,null,null,null,null,null,null,7,"|",null,"|","|","|","|",null,"Housing with drive cage type A (for frontside mounted removable tray) + COM2 port; 2x 100/240V AC redundant industrial power supply",null,{"$f":"IF($P$8=8,\"X\",\"\")","v":""}]
[null,null,null,null,null,null,null,null,8,"|",null,"|","|","|","|",null,"Housing with drive cage type A (for frontside mounted removable tray) + COM2 port; 100/240V AC industrial power supply, 850W",null,{"$f":"IF($P$8=9,\"X\",\"\")","v":""}]
[null,null,null,null,null,null,null,null,null,"|",null,"|","|","|","|"]
[null,null,null,null,null,null,null,null,null,"|",null,"|","|","|","|",null,"Main Memory"]
[null,null,null,null,null,null,null,null,null,0,null,"|","|","|","|",null,"4 GB DDR4 SDRAM (1x 4 GB), Single Channel;",null,{"$f":"IF($P$9=1,\"X\",\"\")","v":"X"}]
[null,null,null,null,null,null,null,null,null,1,null,"|","|","|","|",null,"8 GB DDR4 SDRAM (2x 4 GB), Dual Channel;",null,{"$f":"IF($P$9=2,\"X\",\"\")","v":""}]
[null,null,null,null,null,null,null,null,null,2,null,"|","|","|","|",null,"16 GB DDR4 SDRAM (2x 8 GB), Dual Channel;",null,{"$f":"IF($P$9=3,\"X\",\"\")","v":""}]
[null,null,null,null,null,null,null,null,null,3,null,"|","|","|","|",null,"32 GB DDR4 SDRAM (2x 16 GB), Dual Channel;",null,{"$f":"IF($P$9=4,\"X\",\"\")","v":""}]
[null,null,null,null,null,null,null,null,null,4,null,"|","|","|","|",null,"64 GB DDR4 SDRAM (4x 16 GB), Dual Channel;",null,{"$f":"IF($P$9=5,\"X\",\"\")","v":""}]
[null,null,null,null,null,null,null,null,null,5,null,"|","|","|","|",null,"128 GB DDR4 SDRAM (4x 32 GB), Dual Channel;",null,{"$f":"IF($P$9=6,\"X\",\"\")","v":""}]
[null,null,null,null,null,6,null,null,null,{"$f":"IF(OR(($P$6=4),($P$6=5),($P$6=6),($P$6=7),($P$6=8),($P$6=9)),\"!\",\"6\")","v":"6"},null,"|","|","|","|",null,"16 GB DDR4 SDRAM (2x 8 GB), Dual Channel; ECC [only with Core i3 / Xeon]",null,{"$f":"IF($P$9=7,\"X\",\"\")","v":""}]
[null,null,null,null,null,null,null,null,null,{"$f":"IF(OR(($P$6=4),($P$6=5),($P$6=6),($P$6=7),($P$6=8),($P$6=9)),\"!\",\"7\")","v":"7"},null,"|","|","|","|",null,"32 GB DDR4 SDRAM (2x 16 GB), Dual Channel; ECC [only with Core i3 / Xeon]",null,{"$f":"IF($P$9=8,\"X\",\"\")","v":""}]
[null,null,null,null,null,null,null,null,null,{"$f":"IF(OR(($P$6=4),($P$6=5),($P$6=6),($P$6=7),($P$6=8),($P$6=9)),\"!\",\"8\")","v":"8"},null,"|","|","|","|",null,"64 GB DDR4 SDRAM (4x 16 GB), Dual Channel; ECC [only with Core i3 / Xeon]",null,{"$f":"IF($P$9=9,\"X\",\"\")","v":""}]
[null,null,null,null,null,null,null,null,null,null,null,"|","|","|","|"]
[null,null,null,null,null,null,null,null,null,null,null,"|","|","|","|",null,"Extensions (Hardware)"]
[null,null,null,null,null,null,null,null,null,null,null,0,"|","|","|",null,"without extensions",null,{"$f":"IF($P$10=1,\"X\",\"\")","v":"X"}]
[null,null,null,null,null,null,null,null,null,null,null,1,"|","|","|",null,"PCIe x4 carrier board for SSD M.2 NVMe module without SSD (1 Slot occupied)",null,{"$f":"IF($P$10=2,\"X\",\"\")","v":""}]
[null,null,null,null,null,null,null,null,null,null,null,2,"|","|","|",null,"PCIe x16 graphics card NVIDIA T400 (3x mDP: 3x adapter mDP to DP), 4 GB (1 Slot occupied)",null,{"$f":"IF($P$10=3,\"X\",\"\")","v":""}]
[null,null,null,null,null,null,null,null,null,null,null,{"$f":"IF(AND(OR($H$5=\"K\",$H$5=\"L\",$H$5=\"M\",$H$5=\"N\"),OR($G$5=\"A\",$G$5=\"D\",$G$5=\"G\",$G$5=\"K\")),\"*\",3)","v":3},"|","|","|",null,"PCIe x4 carrier board for SSD M.2 NVMe module without SSD (1 Slot occupied) + PCIe x16 graphics card NVIDIA T400 (3x mDP: 3x adapter mDP to DP), 4 GB (1 Slot occupied)",null,{"$f":"IF($P$10=4,\"X\",\"\")","v":""}]
[null,null,null,null,null,null,null,null,null,null,null,4,"|","|","|",null,"512 GB SSD M.2 NVMe on PCIe x4 carrier board (1 Slot occupied) (for OS)",null,{"$f":"IF($P$10=5,\"X\",\"\")","v":""}]
[null,null,null,null,null,null,null,null,null,null,null,{"$f":"IF(AND(OR($H$5=\"K\",$H$5=\"L\",$H$5=\"M\",$H$5=\"N\"),OR($G$5=\"A\",$G$5=\"D\",$G$5=\"G\",$G$5=\"K\")),\"*\",5)","v":5},"|","|","|",null,"512 GB SSD M.2 NVMe on PCIe x4 carrier board (1 Slot occupied) (for OS) + PCIe x16 graphics card NVIDIA T400 (3x mDP: 3x adapter mDP to DP), 4 GB (1 Slot occupied)",null,{"$f":"IF($P$10=6,\"X\",\"\")","v":""}]
[null,null,null,null,null,null,null,null,null,null,null,6,"|","|","|",null,"1024 GB SSD M.2 NVMe on PCIe x4 carrier board (1 Slot occupied) (for OS)",null,{"$f":"IF($P$10=7,\"X\",\"\")","v":""}]
["NEW",null,null,null,null,null,null,null,null,null,null,{"$f":"IF(OR(($P$8=1),($P$8=2),($P$8=3),($P$8=4),($P$8=5),($P$8=6),($P$8=7),($P$8=8)),\"!\",\"7\")","v":"!"},"|","|","|",null,"PCIe x16 graphics card NVIDIA RTX 4000 (3x DP), 8 GB (1 Slot occupied) [only with 850W PS]",null,{"$f":"IF($P$10=8,\"X\",\"\")","v":""}]
[null,null,null,null,null,null,null,null,null,null,null,null,"|","|","|"]
[null,null,null,null,null,null,null,null,null,null,null,null,"|","|","|",null,"Operating Systems (pre-installed and activated)"]
[null,null,null,null,null,null,null,null,null,null,null,null,{"$f":"IF(OR(($P$6=7),($P$6=8),($P$6=9),($P$6=10),($P$6=11),($P$6=12),($P$6=13),($P$6=14),($P$6=15),($P$10=8)),\"!\",\"A\")","v":"A"},"|","|",null,"Windows 10 Enterprise 2016 LTSB, Multi Language (En, Ger, Fr, It, Sp), 64 bit;[for processors Core i3 / Core i5]",null,{"$f":"IF($P$11=1,\"X\",\"\")","v":""}]
[null,null,null,null,null,null,null,null,null,null,null,null,{"$f":"IF(OR(($P$6=1),($P$6=2),($P$6=3),($P$6=4),($P$6=5),($P$6=6),($P$6=13),($P$6=14),($P$6=15),($P$10=8)),\"!\",\"B\")","v":"!"},"|","|",null,"Windows 10 Enterprise 2016 LTSB, Multi Language (En, Ger, Fr, It, Sp), 64 bit;[for processor Core i7 / Xeon]",null,{"$f":"IF($P$11=2,\"X\",\"\")","v":""}]
[null,{"$f":"IF(AND(OR($P$6=7,$P$6=8,$P$6=9,$P$6=10,$P$6=11,$P$6=12,),$P$11=4),1,0)","v":0},"The selected combination is not valid: PCIe x8 RAID controller only with Windows server OS or Windows 7, 64Bit"," .",null,null,null,null,null,null,null,null,{"$f":"IF(OR(($P$6=7),($P$6=8),($P$6=9),($P$6=10),($P$6=11),($P$6=12),($P$6=13),($P$6=14),($P$6=15)),\"!\",\"C\")","v":"C"},"|","|",null,"Windows 10 IoT Enterprise 2019 LTSC, Multi Language (En, Ger, Fr, It, Sp), 64 bit;[for processors Core i3 / Core i5]",null,{"$f":"IF($P$11=3,\"X\",\"\")","v":""}]
[null,{"$f":"IF(AND(OR($P$7=17,$P$7=18,$P$7=19,$P$7=20,),$P$11=5),1,0)","v":0},"The selected combination is not valid: PCIe x8 RAID controller only with Windows server OS or Windows 7, 64Bit"," .",null,null,null,null,null,null,null,null,{"$f":"IF(OR(($P$6=1),($P$6=2),($P$6=3),($P$6=4),($P$6=5),($P$6=6)),\"!\",\"D\")","v":"!"},"|","|",null,"Windows 10 IoT Enterprise 2019 LTSC, Multi Language (En, Ger, Fr, It, Sp), 64 bit;[for processor Core i7 / Xeon]",null,{"$f":"IF($P$11=4,\"X\",\"\")","v":""}]
["NEW",{"$f":"IF(AND(OR($P$6=7,$P$6=8,$P$6=9,$P$6=10,$P$6=11,$P$6=12,),$P$11=4),1,0)","v":0},"The selected combination is not valid: PCIe x8 RAID controller only with Windows server OS or Windows 7, 64Bit"," .",null,null,null,null,null,null,null,null,{"$f":"IF(OR(($P$6=7),($P$6=8),($P$6=9),($P$6=10),($P$6=11),($P$6=12),($P$6=13),($P$6=14),($P$6=15)),\"!\",\"E\")","v":"E"},"|","|",null,"Windows 10 IoT Enterprise 2021 LTSC, Multi Language (En, Ger, Fr, It, Sp), 64 bit;[for processors Core i3 / Core i5]",null,{"$f":"IF($P$11=5,\"X\",\"\")","v":""}]
["NEW",{"$f":"IF(AND(OR($P$7=17,$P$7=18,$P$7=19,$P$7=20,),$P$11=5),1,0)","v":0},"The selected combination is not valid: PCIe x8 RAID controller only with Windows server OS or Windows 7, 64Bit"," .",null,null,null,null,null,null,null,null,{"$f":"IF(OR(($P$6=1),($P$6=2),($P$6=3),($P$6=4),($P$6=5),($P$6=6)),\"!\",\"F\")","v":"!"},"|","|",null,"Windows 10 IoT Enterprise 2021 LTSC, Multi Language (En, Ger, Fr, It, Sp), 64 bit;[for processor Core i7 / Xeon]",null,{"$f":"IF($P$11=6,\"X\",\"\")","v":""}]
[null,null,null,null,null,null,null,null,null,null,null,null,{"$f":"IF(OR(($P$6=13),($P$6=14),($P$6=15),($P$10=8)),\"!\",\"H\")","v":"H"},"|","|",null,"Windows Server 2016 Standard Edition 64 bit, incl. 5 clients multi language (En, Ger, Fr, It, Sp);",null,{"$f":"IF($P$11=7,\"X\",\"\")","v":""}]
[null,null,null,null,null,null,null,null,null,null,null,null,"J","|","|",null,"Windows Server 2019 Standard Edition 64 bit, incl. 5 clients multi language (En, Ger, Fr, It, Sp);",null,{"$f":"IF($P$11=8,\"X\",\"\")","v":""}]
["NEW",null,null,null,null,null,null,null,null,null,null,null,"K","|","|",null,"Windows Server 2022 Standard Edition 64 bit, incl. 5 clients multi language (En, Ger, Fr, It, Sp);",null,{"$f":"IF($P$11=9,\"X\",\"\")","v":""}]
[null,null,null,null,null,null,null,null,null,null,null,null,"X","|","|",null,"without operating System",null,{"$f":"IF($P$11=10,\"X\",\"\")","v":"X"}]
[null,null,null,null,null,null,null,null,null,null,null,null,null,"|","|"]
[null,null,null,null,null,null,null,null,null,null,null,null,null,"|","|",null,"Extensions (Software / Adapter / Security)"]
[null,null,null,null,null,null,null,null,null,null,null,null,null,"A","|",null,"SIMATIC PC DiagMonitor Software added",null,{"$f":"IF($P$12=1,\"X\",\"\")","v":""}]
[null,null,null,null,null,null,null,null,null,null,null,null,null,"B","|",null,"SIMATIC PC Image&Partition Creator Software  added",null,{"$f":"IF($P$12=2,\"X\",\"\")","v":""}]
[null,null,null,null,null,null,null,null,null,null,null,null,null,"C","|",null,"SIMATIC PC DiagMonitor  & ImagePartition Creator Software  added",null,{"$f":"IF($P$12=3,\"X\",\"\")","v":""}]
[null,null,null,null,null,null,null,null,null,null,null,null,null,"H","|",null,"adapter cable DP to VGA for onboard graphics",null,{"$f":"IF($P$12=4,\"X\",\"\")","v":""}]
[null,null,null,null,null,null,null,null,null,null,null,null,null,"J","|",null,"adapter cable DP to DVI-D for onboard graphics",null,{"$f":"IF($P$12=5,\"X\",\"\")","v":""}]
[null,null,null,null,null,null,null,null,null,null,null,null,null,"X","|",null,"without extensions",null,{"$f":"IF($P$12=6,\"X\",\"\")","v":"X"}]
[null,null,null,null,null,null,null,null,null,null,null,null,null,"Y","|",null,"TPM 2.0",null,{"$f":"IF($P$12=7,\"X\",\"\")","v":""}]
[null,null,null,null,null,null,null,null,null,null,null,null,null,null,"|"]
[null,null,null,null,null,null,null,null,null,null,null,null,null,null,"|"]
[null,null,null,null,null,null,null,null,null,null,null,null,null,null,"|",null,"Country-specific types"]
[null,null,null,null,null,null,null,null,null,null,null,null,null,null,0,null,"without power cord;",null,{"$f":"IF($P$13=1,\"X\",\"\")","v":"X"}]
[null,null,null,null,null,null,null,null,null,null,null,null,null,null,1,null,"power cord Europe;",null,{"$f":"IF($P$13=2,\"X\",\"\")","v":""}]
[null,null,null,null,null,null,null,null,null,null,null,null,null,null,2,null,"power cord USA;",null,{"$f":"IF($P$13=3,\"X\",\"\")","v":""}]
[null,null,null,null,null,null,null,null,null,null,null,null,null,null,3,null,"power cord China;",null,{"$f":"IF($P$13=4,\"X\",\"\")","v":""}]
[]
[null,null,null,null,null,null,null,null,null,null,null,null,null,null,null,null," IPC base ",null,"X"]
[]
[{"$f":"A$5","v":"6AG4"},1,1,4,"-",3,{"$f":"G5","v":"A"},{"$f":"H5","v":"X"},{"$f":"I5","v":"0"},{"$f":"J5","v":0},"-",{"$f":"L5","v":0},{"$f":"M5","v":"X"},{"$f":"N5","v":"X"},{"$f":"O5","v":0},null,null,"Total:"]
[]
[]
["Accessories:"]
[null,null,null,null,null,null,null,null,null,null,null,null,null,null,null,null,"Memory Extension"]
["6ES7648-2AL60-0QA0",null,null,null,null,null,null,null,null,null,null,null,null,null,null,null,"4 GB DDR4 DIMM (1x 4); "]
["6ES7648-2AL70-0QA0",null,null,null,null,null,null,null,null,null,null,null,null,null,null,null,"8 GB DDR4 DIMM (1x 8); "]
["6ES7648-2AL80-0QA0",null,null,null,null,null,null,null,null,null,null,null,null,null,null,null,"16 GB DDR4 DIMM (1x 16); "]
["6ES7648-2AL81-0QA0",null,null,null,null,null,null,null,null,null,null,null,null,null,null,null,"32 GB DDR4 DIMM (1x 32); "]
[]
[null,null,null,null,null,null,null,null,null,null,null,null,null,null,null,null,"HW Accessory"]
["6ES7648-0EH00-1BA0",null,null,null,null,null,null,null,null,null,null,null,null,null,null,null,"Tray for low-profile removable frame for 3.5\" HDD (SATA/SAS) and 2.5\" SSD (SATA), w/o drive"]
["6ES7648-1AA00-0XK0",null,null,null,null,null,null,null,null,null,null,null,null,null,null,null,"Retainer to interlock the internal USB interface"]
[]
[null,null,null,null,null,null,null,null,null,null,null,null,null,null,null,null,"Mounting Accessory"]
["6ES7648-1AA01-0XC0",null,null,null,null,null,null,null,null,null,null,null,null,null,null,null,"Tower Kit for converting the Rack IPC into an Industrial Tower PC  IPC547J/IPC847E/IPC RW-545A/IPC RC-545A"]
[]
[null,null,null,null,null,null,null,null,null,null,null,null,null,null,null,null,"Adapter Cable"]
["6ES7648-3AF00-0XA0",null,null,null,null,null,null,null,null,null,null,null,null,null,null,null,"Adapter cable DisplayPort to DVI-D"]
["6ES7648-3AG00-0XA0",null,null,null,null,null,null,null,null,null,null,null,null,null,null,null,"Adapter cable DisplayPort to VGA"]
[]
[]
[null,null,null,null,null,null,null,null,null,null,null,null,null,null,null,null,{"$f":"#REF!","v":{"$error":"#REF!"}}]

{"sheet":"IPC1047E (Rack)","index":8,"n_rows":93,"n_cols":19,"rows_kept":93,"cut":false,"hidden":false,"merged":[]}
["SIMATIC IPC1047E"]
[null,1,8,0,"0-"]
[null,null,null,null,null,null,null,{"$f":"IF(P9=18,#REF!,IF(P9=19,#REF!,IF(P9=20,#REF!,IF(P9=21,#REF!,IF(P9=22,#REF!,IF(P9=23,#REF!,\"\"))))))","v":""},null,null,null,null,null,null,null,{"$f":"P8&P9&P10&P11&P12&P13&P14","v":"1111111"},{"$f":"IF(C18,D18,\"\")&IF(C19,D19,\"\")&IF(C20,D20,\"\")&IF(C21,D21,\"\")&IF(C39,D39,\"\")&IF(C53,D53,\"\")&IF(C58,D58,\"\")&IF(C59,D59,\"\")&IF(C60,D60,\"\")&IF(C35,D35,\"\")&IF(C36,D36,\"\")&IF(C37,D37,\"\")&IF(C86,D86,\"\")&IF(C87,D87,\"\")&IF(C88,D88,\"\")","v":""}]
[null,null,null,null,null,null,null,null,null,null,null,null,null,null,null,1]
["6BK1",8,0,1,"-",1,{"$f":"IF(P8=1,G18,IF(P8=2,G19,IF(P8=3,G20,IF(P8=4,G21))))","v":"A"},{"$f":"IF(P9=1,H24,IF(P9=2,H25,IF(P9=3,H26,IF(P9=4,H27,IF(P9=5,H28,IF(P9=6,H29,IF(P9=7,H30,IF(P9=8,H31,IF(P9=9,H32,IF(P9=10,H33,IF(P9=11,H34,IF(P9=12,H35,IF(P9=13,H36,IF(P9=14,H37,IF(P9=15,H38,IF(P9=16,H39,))))))))))))))))","v":"A"},{"$f":"IF(P10=1,I42,IF(P10=2,I43,IF(P10=3,I44,IF(P10=4,I45,IF(P10=5,I46,IF(P10=6,I47,IF(P10=7,#REF!,\"\")))))))","v":0},{"$f":"IF(P11=1,J50,IF(P11=2,J51,IF(P11=3,J52,IF(P11=4,J53,IF(P11=5,J54)))))","v":0},"-",{"$f":"IF(P12=1,L57,IF(P12=2,L58,IF(P12=3,L59,IF(P12=4,L60,))))","v":0},{"$f":"IF(P13=1,M63,IF(P13=2,M64,IF(P13=3,M65,IF(P13=4,M66,IF(P13=5,M67,IF(P13=6,M68,IF(P13=7,M69,IF(P13=8,M70,IF(P13=9,M71,IF(P13=10,M72,IF(P13=11,M73,\"\")))))))))))","v":"A"},{"$f":"IF(P14=1,N76,IF(P14=2,N77,IF(P14=3,N78,IF(P14=4,N79,IF(P14=5,N80,IF(P14=6,N81,IF(P14=7,N82,IF(P14=8,N83,\"\"))))))))","v":"A"},{"$f":"IF(P15=1,0,IF(P15=2,1,IF(P15=3,2)))","v":0},null,"SIMATIC IPC1047E (Rack-PC)",{"$f":"$A$5&$B$5&$C$5&$D$5&$E$5&$F$5&$G$5&$H$5&$I$5&$J$5&$K$5&$L$5&$M$5&$N$5&$O$5","v":"6BK1801-1AA00-0AA0"}]
[null,null,null,null,null,null,"|","|","|","|",null,"|","|","|","|",1,"19\" 4HE RackPC 572mm"]
[null,null,null,null,null,null,"|","|","|","|",null,"|","|","|","|",1,"2x 1GB LAN (RJ45); COM1; IPMI; 6 PCIe slots (2x PCIe x8 + 4x PCIe x16)"]
[null,null,null,null,null,null,"|","|","|","|",null,"|","|","|","|",1,{"$f":"IF(P8=1,Q18,IF(P8=2,Q19,IF(P8=3,Q20,IF(P8=4,Q21,))))","v":"2x Intel Xeon SP Silver 4210 10C/ 20T - 2,2GHz/ 3,2GHz"}]
[null,null,null,null,null,null,"|","|","|","|",null,"|","|","|","|",1,{"$f":"IF(P9=1,Q24,IF(P9=2,Q25,IF(P9=3,Q26,IF(P9=4,Q27,IF(P9=5,Q28,IF(P9=6,Q29,IF(P9=7,Q30,IF(P9=8,Q31,IF(P9=9,Q32,IF(P9=10,Q33,IF(P9=11,Q34,IF(P9=12,Q35,IF(P9=13,Q36,IF(P9=14,Q37,IF(P9=15,Q38,IF(P9=16,Q39,))))))))))))))))","v":"1x SSD 1 TB M.2 NVMe"}]
[null,null,null,null,null,null,"|","|","|","|",null,"|","|","|","|",1,{"$f":"IF(P10=1,Q42,IF(P10=2,Q43,IF(P10=3,Q44,IF(P10=4,Q45,IF(P10=5,Q46,IF(P10=6,Q47,IF(P10=7,#REF!,\"\")))))))","v":"64 GB DDR4 ECC"}]
[null,null,null,null,null,null,"|","|","|","|",null,"|","|","|","|",1,{"$f":"IF(P11=1,Q50,IF(P11=2,Q51,IF(P11=3,Q52,IF(P11=4,Q53,IF(P11=5,Q54,IF(P11=6,#REF!,\"\"))))))","v":"Without graphics card (onboard VGA)"},"Link utili"]
[null,null,null,null,null,null,"|","|","|","|",null,"|","|","|","|",1,{"$f":"IF(P12=1,Q57,IF(P12=2,Q58,IF(P12=3,Q59,IF(P12=4,Q60,))))","v":"no additional card"},"Certificati"]
[null,null,null,null,null,null,"|","|","|","|",null,"|","|","|","|",1,{"$f":"IF(P13=1,Q63,IF(P13=2,Q64,IF(P13=3,Q65,IF(P13=4,Q66,IF(P13=5,Q67,IF(P13=6,Q68,IF(P13=7,Q69,IF(P13=8,Q70,IF(P13=9,Q71,IF(P13=10,Q72,IF(P13=11,Q73)))))))))))","v":"Without opperating system"},"Datasheet"]
[null,null,null,null,null,null,"|","|","|","|",null,"|","|","|","|",1,{"$f":"IF(P14=1,Q76,IF(P14=2,Q77,IF(P14=3,Q78,IF(P14=4,Q79,IF(P14=5,Q80,IF(P14=6,Q81,IF(P14=7,Q82,IF(P14=8,Q83,\"\"))))))))","v":"860 W without plug "},"Manuale"]
[null,null,null,null,null,null,"|","|","|","|",null,"|","|","|","|",1,{"$f":"IF(P15=1,Q86,IF(P15=2,Q87,IF(P15=3,Q88)))","v":"Holder for 4x 3,5\" or 8x 2,5\" SSD/HDD  - Internal mount        "},"CAD 2D/3D"]
[null,null,null,null,null,null,"|","|","|","|",null,"|","|","|","|"]
[null,null,null,null,null,null,"|","|","|","|",null,"|","|","|","|",null,"CPU:"]
[null,null,{"$f":"IF(AND(S18=\"X\",OR(S66=\"X\",S67=\"X\",S68=\"X\",S71=\"X\",S72=\"X\",S73=\"X\")),1,0)","v":0}," Invalid combination of Windows Server OS and CPU.",null,null,"A","|","|","|",null,"|","|","|","|",null,"2x Intel Xeon SP Silver 4210 10C/ 20T - 2,2GHz/ 3,2GHz",null,{"$f":"IF($P$8=1,\"X\",\"\")","v":"X"}]
[null,null,{"$f":"IF(AND(S19=\"X\",OR(S65=\"X\",S67=\"X\",S68=\"X\",S70=\"X\",S72=\"X\",S73=\"X\")),1,0)","v":0}," Invalid combination of Windows Server OS and CPU.",null,null,"B","|","|","|",null,"|","|","|","|",null,"2x Intel Xeon SP Silver 4216 16C/ 32T - 2,1GHz/ 3,2GHz",null,{"$f":"IF($P$8=2,\"X\",\"\")","v":""}]
[null,null,{"$f":"IF(AND(S20=\"X\",OR(S65=\"X\",S66=\"X\",S68=\"X\",S70=\"X\",S71=\"X\",S73=\"X\")),1,0)","v":0}," Invalid combination of Windows Server OS and CPU.",null,null,"D","|","|","|",null,"|","|","|","|",null,"2x Intel Xeon SP Gold 6226 12C/ 24T - 2,7GHz/ 3,7GHz",null,{"$f":"IF($P$8=3,\"X\",\"\")","v":""}]
[null,null,{"$f":"IF(AND(S21=\"X\",OR(S65=\"X\",S66=\"X\",S67=\"X\",S70=\"X\",S71=\"X\",S72=\"X\")),1,0)","v":0}," Invalid combination of Windows Server OS and CPU.",null,null,"E","|","|","|",null,"|","|","|","|",null,"2x Intel Xeon SP Gold 6230 20C/ 40T - 2,1GHz/ 3,9GHz",null,{"$f":"IF($P$8=4,\"X\",\"\")","v":""}]
[null,null,null,null,null,null,null,"|","|","|",null,"|","|","|","|"]
[null," ",null,null,null,null,null,"|","|","|",null,"|","|","|","|",null,"Drives HDD / SSD:"]
[null,null,null,null,null,null,null,"A","|","|",null,"|","|","|","|",null,"1x SSD 1 TB M.2 NVMe",null,{"$f":"IF($P$9=1,\"X\",\"\")","v":"X"}]
[null,null,null,null,null,null,null,"B","|","|",null,"|","|","|","|",null,"1x SSD 2 TB M.2 NVMe",null,{"$f":"IF($P$9=2,\"X\",\"\")","v":""}]
[null,null,null,null,null,null,null,"C","|","|",null,"|","|","|","|",null,"1x SSD 1 TB M.2 NVMe + 1x HDD 4 TB 3,5\" SATA ",null,{"$f":"IF($P$9=3,\"X\",\"\")","v":""}]
[null,null,null,null,null,null,null,"D","|","|",null,"|","|","|","|",null,"1x SSD 1 TB M.2 NVMe + 1x HDD 8 TB 3,5\" SATA ",null,{"$f":"IF($P$9=4,\"X\",\"\")","v":""}]
[null,null,null,null,null,null,null,"E","|","|",null,"|","|","|","|",null,"1x SSD 1 TB M.2 NVMe + 2x HDD 4 TB 3,5\" SATA  (HW-RAID 1)",null,{"$f":"IF($P$9=5,\"X\",\"\")","v":""}]
[null,null,null,null,null,null,null,"F","|","|",null,"|","|","|","|",null,"1x SSD 1 TB M.2 NVMe + 4x HDD 8 TB 3,5\" SATA (HW-RAID 5 + Hotspare)",null,{"$f":"IF($P$9=6,\"X\",\"\")","v":""}]
[null,null,null,null,null,null,null,"G","|","|",null,"|","|","|","|",null,"1x SSD 1 TB M.2 NVMe + 2x SSD 3,8 TB 2,5\" SATA (HW-RAID 1)",null,{"$f":"IF($P$9=7,\"X\",\"\")","v":""}]
[null,null,null,null,null,null,null,"H","|","|",null,"|","|","|","|",null,"1x SSD 1 TB M.2 NVMe + 3x SSD 3,8 TB 2,5\" SATA (HW-RAID 5)",null,{"$f":"IF($P$9=8,\"X\",\"\")","v":""}]
[null,null,null,null,null,null,null,"J","|","|",null,"|","|","|","|",null,"1x SSD 1 TB M.2 NVMe + 4x SSD 3,8 TB 2,5\" SATA (HW-RAID 5 + Hot Spare)",null,{"$f":"IF($P$9=9,\"X\",\"\")","v":""}]
[null,null,null,null,null,null,null,"K","|","|",null,"|","|","|","|",null,"2x SSD 960 GB 2,5\" SATA (HW-RAID 1) + 2x HDD 8 TB 3,5\" SATA  (HW-RAID 1)",null,{"$f":"IF($P$9=10,\"X\",\"\")","v":""}]
[null,null,null,null,null,null,null,"L","|","|",null,"|","|","|","|",null,"2x SSD 960 GB 2,5\" SATA (HW-RAID 1) + 2x SSD 3,8 TB 2,5\" SATA (HW-RAID 1)",null,{"$f":"IF($P$9=11,\"X\",\"\")","v":""}]
[null,null,{"$f":"IF(AND(S35=\"X\",S53=\"X\"),1,0)","v":0}," SSD option not combineable with the Nvidia Quadro RTX5000 GPU.",null,null,null,"M","|","|",null,"|","|","|","|",null,"1x SSD 1 TB M.2 NVMe + 2x SSD 7,68 TB 2,5\" U.3 (Only internal mounting)",null,{"$f":"IF($P$9=12,\"X\",\"\")","v":""}]
[null,null,{"$f":"IF(AND(S36=\"X\",S53=\"X\"),1,0)","v":0}," SSD option not combineable with the Nvidia Quadro RTX5000 GPU.",null,null,null,"N","|","|",null,"|","|","|","|",null,"1x SSD 1 TB M.2 NVMe + 2x SSD 1,92 TB 2,5\" U.3 VROC RAID 1 (Only internal mounting)",null,{"$f":"IF($P$9=13,\"X\",\"\")","v":""}]
[null,null,{"$f":"IF(AND(S37=\"X\",S53=\"X\"),1,0)","v":0}," SSD option not combineable with the Nvidia Quadro RTX5000 GPU.",null,null,null,"P","|","|",null,"|","|","|","|",null,"1x SSD 1 TB M.2 NVMe + 3x SSD 1,92 TB 2,5\" U.3 VROC RAID 5 (Only internal mounting)",null,{"$f":"IF($P$9=14,\"X\",\"\")","v":""}]
[null,null,null,null,null,null,null,"Q","|","|",null,"|","|","|","|",null,"1x SSD 1 TB M.2 NVMe + 8x SSD 1,92 TB 2,5\" (Only with 8x front side mount)",null,{"$f":"IF($P$9=15,\"X\",\"\")","v":""}]
[null,null,{"$f":"IF(AND(S39=\"X\",OR(S64=\"X\",S65=\"X\",S66=\"X\",S67=\"X\",S68=\"X\",S69=\"X\",S70=\"X\", S71=\"X\",S72=\"X\",S73=\"X\")),1,0)","v":0}," An OS can only be configured with drives.",null,null,null,"Y","|","|",null,"|","|","|","|",null,"Without drives",null,{"$f":"IF($P$9=16,\"X\",\"\")","v":""}]
[null,null,null,null,null,null,null,null,"|","|",null,"|","|","|","|"]
[null,null,null,null,null,null,null,null,"|","|",null,"|","|","|","|",null,"Main memory:"]
[null,null,null,null,null,null,null,null,0,"|",null,"|","|","|","|",null,"64 GB DDR4 ECC",null,{"$f":"IF($P$10=1,\"X\",\"\")","v":"X"}]
[null,null,null,null,null,null,null,null,1,"|",null,"|","|","|","|",null,"128 GB DDR4 ECC",null,{"$f":"IF($P$10=2,\"X\",\"\")","v":""}]
[null,null,null,null,null,null,null,null,2,"|",null,"|","|","|","|",null,"192 GB DDR4 ECC",null,{"$f":"IF($P$10=3,\"X\",\"\")","v":""}]
[null,null,null,null,null,null,null,null,3,"|",null,"|","|","|","|",null,"256 GB DDR4 ECC",null,{"$f":"IF($P$10=4,\"X\",\"\")","v":""}]
[null,null,null,null,null,null,null,null,4,"|",null,"|","|","|","|",null,"384 GB DDR4 ECC",null,{"$f":"IF($P$10=5,\"X\",\"\")","v":""}]
[null,null,null,null,null,null,null,null,5,"|",null,"|","|","|","|",null,"512 GB DDR4 ECC",null,{"$f":"IF($P$10=6,\"X\",\"\")","v":""}]
[null,null,null,null,null,null,null,null,null,"|",null,"|","|","|","|"]
[null,null,null,null,null,null,null,null,null,"|",null,"|","|","|","|",null,"GPU:"]
[null,null,null,null,null,null,null,null,null,0,null,"|","|","|","|",null,"Without graphics card (onboard VGA)",null,{"$f":"IF($P$11=1,\"X\",\"\")","v":"X"}]
[null,null,null,null,null,null,null,null,null,1,null,"|","|","|","|",null,"1x Nvidia Quadro P620 (1x PCIe x16 used)",null,{"$f":"IF($P$11=2,\"X\",\"\")","v":""}]
[null,null,null,null,null,null,null,null,null,2,null,"|","|","|","|",null,"1x Nvidia Quadro RTX4000 (1x PCIe x16 used) ",null,{"$f":"IF($P$11=3,\"X\",\"\")","v":""}]
[null,null,{"$f":"IF(AND(S53=\"X\",OR(S80=\"X\",S81=\"X\",S82=\"X\",S83=\"X\")),1,0)","v":0}," Nvidia Quadro RTX5000 GPU is only combinable with the 860 W Power Supply.",null,null,null,null,null,3,null,"|","|","|","|",null,"1x Nvidia Quadro RTX5000 (1x PCIe x16 + 1x PCIe x8 used) - 860W PSU, no other PCIe cards",null,{"$f":"IF($P$11=4,\"X\",\"\")","v":""}]
[null,null,null,null,null,null,null,null,null,4,null,"|","|","|","|",null,"1x Nvidia Quadro RTX A4000 (1x PCIe x16 belegt) ",null,{"$f":"IF($P$11=5,\"X\",\"\")","v":""}]
[null,null,null,null,null,null,null,null,null,null,null,"|","|","|","|"]
[null,null,null,null,null,null,null,null,null,null,null,"|","|","|","|",null,"Extension 2:"]
[null,null,null,null,null,null,null,null,null,null,null,0,"|","|","|",null,"no additional card",null,{"$f":"IF($P$12=1,\"X\",\"\")","v":"X"}]
[null,null,{"$f":"IF(AND(S58=\"X\",S53=\"X\"),1,0)","v":0}," The chosen PCIe expansion cards are not combineable.",null,null,null,null,null,null,null,1,"|","|","|",null,"Intel I350-T2 (2x 1GB LAN)",null,{"$f":"IF($P$12=2,\"X\",\"\")","v":""}]
[null,null,{"$f":"IF(AND(S59=\"X\",S53=\"X\"),1,0)","v":0}," The chosen PCIe expansion cards are not combineable.",null,null,null,null,null,null,null,2,"|","|","|",null,"Intel I350-T4 (4x 1GB LAN)",null,{"$f":"IF($P$12=3,\"X\",\"\")","v":""}]
[null,null,{"$f":"IF(AND(S60=\"X\",S53=\"X\"),1,0)","v":0}," The chosen PCIe expansion cards are not combineable.",null,null,null,null,null,null,null,4,"|","|","|",null,"Intel X710-T2L (2x 10GB LAN)",null,{"$f":"IF($P$12=4,\"X\",\"\")","v":""}]
[null,null,null,null,null,null,null,null,null,null,null,null,"|","|","|"]
[null,null,null,null,null,null,null,null,null,null,null,null,"|","|","|",null,"Operating system - only with mounted drives:"]
[null,null,null,null,null,null,null,null,null,null,null,null,"A","|","|",null,"Without opperating system",null,{"$f":"IF($P$13=1,\"X\",\"\")","v":"X"}]
[null,null,null,null,null,null,null,null,null,null,null,null,"B","|","|",null,"Windows 10 Enterprise LTSC 2019",null,{"$f":"IF($P$13=2,\"X\",\"\")","v":""}]
[null,null,null,null,null,null,null,null,null,null,null,null,"C","|","|",null,"Windows Server 2019 - for XEON Silver 4210 (20C) ",null,{"$f":"IF($P$13=3,\"X\",\"\")","v":""}]
[null,null,null,null,null,null,null,null,null,null,null,null,"D","|","|",null,"Windows Server 2019 - for XEON Silver 4216 (32C)",null,{"$f":"IF($P$13=4,\"X\",\"\")","v":""}]
[null,null,null,null,null,null,null,null,null,null,null,null,"E","|","|",null,"Windows Server 2019 - for XEON Gold 6226 (24C)",null,{"$f":"IF($P$13=5,\"X\",\"\")","v":""}]
[null,null,null,null,null,null,null,null,null,null,null,null,"F","|","|",null,"Windows Server 2019 - for XEON Gold 6230 (40C)",null,{"$f":"IF($P$13=6,\"X\",\"\")","v":""}]
[null,null,null,null,null,null,null,null,null,null,null,null,"G","|","|",null,"Windows 10 Enterprise LTSC 2021",null,{"$f":"IF($P$13=7,\"X\",\"\")","v":""}]
[null,null,null,null,null,null,null,null,null,null,null,null,"H","|","|",null,"Windows Server 2022 - for XEON Silver 4210 (20C) ",null,{"$f":"IF($P$13=8,\"X\",\"\")","v":""}]
[null,null,null,null,null,null,null,null,null,null,null,null,"J","|","|",null,"Windows Server 2022 - for XEON Silver 4216 (32C)",null,{"$f":"IF($P$13=9,\"X\",\"\")","v":""}]
[null,null,null,null,null,null,null,null,null,null,null,null,"K","|","|",null,"Windows Server 2022 - for XEON Gold 6226 (24C)",null,{"$f":"IF($P$13=10,\"X\",\"\")","v":""}]
[null,null,null,null,null,null,null,null,null,null,null,null,"L","|","|",null,"Windows Server 2022 - for XEON Gold 6230 (40C)",null,{"$f":"IF($P$13=11,\"X\",\"\")","v":""}]
[null,null,null,null,null,null,null,null,null,null,null,null,null,"|","|"]
[null,null,null,null,null,null,null,null,null,null,null,null,null,"|","|",null,"Power supply:"]
[null,null,null,null,null,null,null,null,null,null,null,null,null,"A","|",null,"860 W without plug ",null,{"$f":"IF($P$14=1,\"X\",\"\")","v":"X"}]
[null,null,null,null,null,null,null,null,null,null,null,null,null,"B","|",null,"860 W with EU plug",null,{"$f":"IF($P$14=2,\"X\",\"\")","v":""}]
[null,null,null,null,null,null,null,null,null,null,null,null,null,"C","|",null,"860 W with US plug",null,{"$f":"IF($P$14=3,\"X\",\"\")","v":""}]
[null,null,null,null,null,null,null,null,null,null,null,null,null,"D","|",null,"860 W with China plug",null,{"$f":"IF($P$14=4,\"X\",\"\")","v":""}]
[null,null,null,null,null,null,null,null,null,null,null,null,null,"E","|",null,"700 W redundant without plug ",null,{"$f":"IF($P$14=5,\"X\",\"\")","v":""}]
[null,null,null,null,null,null,null,null,null,null,null,null,null,"F","|",null,"700 W redundant with EU plug",null,{"$f":"IF($P$14=6,\"X\",\"\")","v":""}]
[null,null,null,null,null,null,null,null,null,null,null,null,null,"G","|",null,"700 W redundant with US plug",null,{"$f":"IF($P$14=7,\"X\",\"\")","v":""}]
[null,null,null,null,null,null,null,null,null,null,null,null,null,"H","|",null,"700 W redundant with China plug",null,{"$f":"IF($P$14=8,\"X\",\"\")","v":""}]
[null,null,null,null,null,null,null,null,null,null,null,null,null,null,"|"]
[null,null,null,null,null,null,null,null,null,null,null,null,null,null,"|",null,"Housing option:"]
[null,null,{"$f":"IF(AND(S86=\"X\",OR(S38=\"X\",S39=\"X\")),1,0)","v":0}," Combination of storage mount and storage option is not possible.",null,null,null,null,null,null,null,null,null,null,0,null,"Holder for 4x 3,5\" or 8x 2,5\" SSD/HDD  - Internal mount        ",null,{"$f":"IF($P$15=1,\"X\",\"\")","v":"X"}]
[null,null,{"$f":"IF(AND(S87=\"X\",OR(S35=\"X\",S36=\"X\",S37=\"X\",S38=\"X\")),1,0)","v":0}," Combination of storage mount and storage option is not possible.",null,null,null,null,null,null,null,null,null,null,1,null,"Holder for 4x 3,5\" or 4x 2,5\" SSD/HDD  - front side mount",null,{"$f":"IF($P$15=2,\"X\",\"\")","v":""}]
[null,null,{"$f":"IF(AND(S88=\"X\",OR(S26=\"X\",S27=\"X\",S28=\"X\",S29=\"X\",S30=\"X\",S31=\"X\",S32=\"X\", S33=\"X\",S34=\"X\",S34=\"X\",S35=\"X\",S36=\"X\",S37=\"X\")),1,0)","v":0}," Combination of storage mount and storage option is not possible.",null,null,null,null,null,null,null,null,null,null,2,null,"Holder for 8x 2,5\" SSD  - front side mount (only with drive option A, B, Q, Y)",null,{"$f":"IF($P$15=3,\"X\",\"\")","v":""}]
[]
[]
[null,null,null,null,null,null,null,null,null,null,null,null,null,null,null,null," IPC base ",null,"X"]
[]
["6BK",{"$f":"B$5","v":8},{"$f":"C$5","v":0},{"$f":"D$5","v":1},{"$f":"E$5","v":"-"},{"$f":"F$5","v":1},{"$f":"G5","v":"A"},{"$f":"H5","v":"A"},{"$f":"I5","v":0},{"$f":"J5","v":0},"-",{"$f":"L5","v":0},{"$f":"M5","v":"A"},{"$f":"N5","v":"A"},{"$f":"O5","v":0},null,null,"Total:"]

{"sheet":"IPC RS-828A (Rack)","index":9,"n_rows":87,"n_cols":21,"rows_kept":87,"cut":false,"hidden":false,"merged":[]}
["SIMATIC IPC RS-828A",null,null,null,null,null,null,null,null,null,null,null,null,null,null,null,{"$f":"IF(OR(($G$5=\"!\"),($H$5=\"!\"),($I$5=\"!\"),($J$5=\"!\"),($L$5=\"!\"),($M$5=\"!\"),($N$5=\"!\"),($O$5=\"!\")),#REF!,\"\")","v":""},null,null,null,"."]
[]
[null,null,null,null,null,null,null,null,null,null,null,null,null,null,null,null,{"$f":"IF(E37,F37,\"\")","v":""}]
[]
["6AG4",1,0,2,"-",0,{"$f":"IF(P11=1,G21,)&IF(P11=2,G22,)&IF(P11=3,G23,)&IF(P11=4,G24,)&IF(P11=5,#REF!,)&IF(P11=6,#REF!,)&IF(P11=7,#REF!,)&IF(P11=8,#REF!,)&IF(P11=9,#REF!,)","v":"A"},{"$f":"IF(P12=1,H27,)&IF(P12=2,H28,)&IF(P12=3,H29,)&IF(P12=4,H30,)&IF(P12=5,H31,)&IF(P12=6,H32,)&IF(P12=7,H33,)&IF(P12=8,H34,)&IF(P12=9,H35,)&IF(P12=10,H36,)&IF(P12=11,H37,)&IF(P12=12,H38,)&IF(P12=13,H39,)&IF(P12=14,H40,)","v":"A"},{"$f":"IF(P13=1,I43,IF(P13=2,I44,IF(P13=3,#REF!,IF(P13=4,#REF!,IF(P13=5,#REF!,)))))","v":0},{"$f":"IF(P14=1,J47,IF(P14=2,J48,IF(P14=3,J49,IF(P14=4,J50,IF(P14=5,#REF!,IF(P14=6,#REF!,IF(P14=7,#REF!,IF(P14=8,#REF!,))))))))","v":0},"-",{"$f":"IF(P15=1,L53,IF(P15=2,L54,IF(P15=3,#REF!,IF(P15=4,#REF!,IF(P15=5,#REF!,IF(P15=6,#REF!,))))))","v":0},{"$f":"IF(P16=1,M57,IF(P16=2,M58,IF(P16=3,M59,IF(P16=4,M60,IF(P16=5,M61,IF(P16=6,M62,IF(P16=7,M63,IF(P16=8,M64,IF(P16=9,M65,IF(P16=10,M66,IF(P16=11,M67,)))))))))))","v":"X"},{"$f":"IF(P17=1,N70,IF(P17=2,N71,IF(P17=3,N72,IF(P17=4,N73,IF(P17=5,N74)))))","v":"X"},{"$f":"IF(P18=1,O77,IF(P18=2,O78,IF(P18=3,O79,IF(P18=4,O80,IF(P18=5,#REF!,IF(P18=6,#REF!,IF(P18=7,#REF!)))))))","v":0},null,"SIMATIC IPC RS-828A (RACK PC, 19\", 2U), Dual Socket SP5",{"$f":"$A$5&$B$5&$C$5&$D$5&$E$5&$F$5&$G$5&$H$5&$I$5&$J$5&$K$5&$L$5&$M$5&$N$5&$O$5","v":"6AG4102-0AA00-0XX0"}]
[null,null,null,null,null,null,"|","|","|","|",null,"|","|","|","|",null,"Interfaces front: 2x USB 3.1  (Type A) frontside; LED Indicators: Power, SSD, Ethernet 1-2, Watchdog, Temp, Fans, drives alarm, PS alarm"]
[null,null,null,null,null,null,"|","|","|","|",null,"|","|","|","|",null,"Interfaces rear: 2x 10 Gbit Ethernet (IE/PN), RJ45; 1x 1 Gbit Ethernet (BMC), RJ45;  1x COM1; 1x VGA; 4x USB 3.1 Gen. 2, Type A"]
[null,null,null,null,null,null,"|","|","|","|",null,"|","|","|","|",null,"Interfaces internaly:  2x M.2 PCIe x4, Key M, 22110 Slot;"]
[null,null,null,null,null,null,"|","|","|","|",null,"|","|","|","|",null,"Riser card: 2 x PCI-E Gen5 x16 Slot optional for 2 x DW GPU Card    or    4 x PCI-E Gen5 x8 (FHFL)   +   3 x PCI-E Gen5 x16 Slot (FHHL)"]
[null,null,null,null,null,null,"|","|","|","|",null,"|","|","|","|",null,"System Management: IPMI 2.0 / RedFish, TPM 2.0"]
[null,null,null,null,null,null,"|","|","|","|",null,"|","|","|","|",1,{"$f":"IF(P11=1,Q21,IF(P11=2,Q22,IF(P11=3,Q23,IF(P11=4,Q24))))","v":"2x AMD EPYC™ 9124 Embedded Series Server Processors - max. 240W cTDP, 16 Cores/each"}]
[null,null,null,null,null,null,"|","|","|","|",null,"|","|","|","|",1,{"$f":"IF(P12=1,Q27,IF(P12=2,Q28,IF(P12=3,Q29,IF(P12=4,Q30,IF(P12=5,Q31,IF(P12=6,Q32,IF(P12=7,Q33,IF(P12=8,Q34,IF(P12=9,Q35,IF(P12=10,Q36,IF(P12=11,Q37,IF(P12=12,Q38,IF(P12=13,Q39,IF(P12=14,Q40,))))))))))))))","v":"1x 2 TB 2.5\" SATA SSD"}]
[null,null,null,null,null,null,"|","|","|","|",null,"|","|","|","|",1,{"$f":"IF(P13=1,Q43,IF(P13=2,Q44,IF(P13=3,#REF!,IF(P13=4,#REF!))))","v":"1x 1 TB SSD M.2 NVMe"}]
[null,null,null,null,null,null,"|","|","|","|",null,"|","|","|","|",1,{"$f":"IF(P14=1,Q47,IF(P14=2,Q48,IF(P14=3,Q49,IF(P14=4,Q50,IF(P14=5,#REF!)))))","v":"256 GB DDR5-4800MHz RDIMM ECC"}]
[null,null,null,null,null,null,"|","|","|","|",null,"|","|","|","|",1,{"$f":"IF(P15=1,Q53,IF(P15=2,Q54,IF(P15=3,#REF!,IF(P15=4,#REF!,IF(P15=5,#REF!,IF(P15=6,#REF!))))))","v":"without extension card"}]
[null,null,null,null,null,null,"|","|","|","|",null,"|","|","|","|",11,{"$f":"IF(P16=1,Q57,IF(P16=2,Q58,IF(P16=3,Q59,IF(P16=4,Q60,IF(P16=5,Q61,IF(P16=6,Q62,IF(P16=7,Q63,IF(P16=8,Q64,IF(P16=9,Q65,IF(P16=10,Q66,IF(P16=11,Q67)))))))))))","v":"without AI Accelerator"}]
[null,null,null,null,null,null,"|","|","|","|",null,"|","|","|","|",5,{"$f":"IF(P17=1,Q70,IF(P17=2,Q71,IF(P17=3,Q72,IF(P17=4,Q73,IF(P17=5,Q74)))))","v":"without operating system"}]
[null,null,null,null,null,null,"|","|","|","|",null,"|","|","|","|",1,{"$f":"IF(P18=1,Q77,IF(P18=2,Q78,IF(P18=3,Q79,IF(P18=4,Q80))))","v":"power supply 2600 W (2 Module à 2600 W, redundant) - without power cords"}]
[null,null,null,null,null,null,"|","|","|","|",null,"|","|","|","|"]
[null,null,null,null,null,null,"|","|","|","|",null,"|","|","|","|",null,"Processor"]
[null,null,null,null,null,null,"A","|","|","|",null,"|","|","|","|",null,"2x AMD EPYC™ 9124 Embedded Series Server Processors - max. 240W cTDP, 16 Cores/each",null,{"$f":"IF($P$11=1,\"X\",\"\")","v":"X"}]
[null,null,null,null,null,null,"B","|","|","|",null,"|","|","|","|",null,"2x AMD EPYC™ 9254 Embedded Series Server Processors - max. 240W cTDP, 24 Cores/each",null,{"$f":"IF($P$11=2,\"X\",\"\")","v":""}]
[null,null,null,null,null,null,"C","|","|","|",null,"|","|","|","|",null,"2x AMD EPYC™ 9354 Embedded Series Server Processors - max. 300W cTDP, 32 Cores/each",null,{"$f":"IF($P$11=3,\"X\",\"\")","v":""}]
[null,null,null,null,null,null,"D","|","|","|",null,"|","|","|","|",null,"2x AMD EPYC™ 9454 Embedded Series Server Processors - max. 400W cTDP, 48 Cores/each",null,{"$f":"IF($P$11=4,\"X\",\"\")","v":""}]
[null,null,null,null,null,null,null,"|","|","|",null,"|","|","|","|"]
[null,null,null,null,null,null,null,"|","|","|",null,"|","|","|","|",null,"Drives installed in removable tray"]
[null,null,null,null,null,null,null,"A","|","|",null,"|","|","|","|",null,"1x 2 TB 2.5\" SATA SSD",null,{"$f":"IF($P$12=1,\"X\",\"\")","v":"X"}]
[null,null,null,null,null,null,null,"B","|","|",null,"|","|","|","|",null,"2x 2 TB 2.5\" SATA SSD",null,{"$f":"IF($P$12=2,\"X\",\"\")","v":""}]
[null,null,null,null,null,null,null,"C","|","|",null,"|","|","|","|",null,"4x 2 TB 2.5\" SATA SSD",null,{"$f":"IF($P$12=3,\"X\",\"\")","v":""}]
[null,null,null,null,null,null,null,"D","|","|",null,"|","|","|","|",null,"6x 2 TB 2.5\" SATA SSD",null,{"$f":"IF($P$12=4,\"X\",\"\")","v":""}]
[null,null,null,null,null,null,null,"E","|","|",null,"|","|","|","|",null,"2x 2 TB 2.5\" SATA SSD + HW RAID Controller (1 PCIe Slot occupied), RAID 1 pre-configurated",null,{"$f":"IF($P$12=5,\"X\",\"\")","v":""}]
[null,null,null,null,null,null,null,"F","|","|",null,"|","|","|","|",null,"4x 2 TB 2.5\" SATA SSD + HW RAID Controller, RAID 5 + hot spare pre-configurated",null,{"$f":"IF($P$12=6,\"X\",\"\")","v":""}]
[null,null,null,null,null,null,null,"G","|","|",null,"|","|","|","|",null,"6x 2 TB 2.5\" SATA SSD + HW RAID Controller, RAID 5 + hot spare pre-configurated",null,{"$f":"IF($P$12=7,\"X\",\"\")","v":""}]
[null,null,null,null,null,null,null,"H","|","|",null,"|","|","|","|",null,"1x 2 TB 2,5\" U.3 NVMe SSD",null,{"$f":"IF($P$12=8,\"X\",\"\")","v":""}]
[null,null,null,null,null,null,null,"J","|","|",null,"|","|","|","|",null,"2x 2 TB 2,5\" U.3 NVMe SSD",null,{"$f":"IF($P$12=9,\"X\",\"\")","v":""}]
[null,null,null,null,{"$f":"IF(AND(OR(P12=1),OR(P16=1,P16=2,P16=3,P16=4),P11=10),1,0)","v":0},"KONFIGURATION NICHT MÖGLICH: Das Betriebssystem ist nur mit HDD/SSD Laufwerke lieferbar",null,"K","|","|",null,"|","|","|","|",null,"4x 2 TB 2,5\" U.3 NVMe SSD",null,{"$f":"IF($P$12=10,\"X\",\"\")","v":""}]
[null,null,null,null,{"$f":"IF(AND(OR(P13=1),OR(P17=1,P17=2,P17=3,P17=4),P12=10),1,0)","v":0},"KONFIGURATION NICHT MÖGLICH: Das Betriebssystem ist nur mit HDD/SSD Laufwerke lieferbar",null,"L","|","|",null,"|","|","|","|",null,"2x 2 TB 2,5\" U.3 NVMe SSD + HW RAID Controller incl.  Power save module, RAID 1 pre-configurated",null,{"$f":"IF($P$12=11,\"X\",\"\")","v":""}]
[null,null,null,null,{"$f":"IF(AND(OR(P14=1),OR(P18=1,P18=2,P18=3,P18=4),P13=10),1,0)","v":0},"KONFIGURATION NICHT MÖGLICH: Das Betriebssystem ist nur mit HDD/SSD Laufwerke lieferbar",null,"M","|","|",null,"|","|","|","|",null,"4x 2 TB 2,5\" U.3 NVMe SSD + HW RAID Controller incl.  Power save module, RAID 5 + hot spare pre-configurated",null,{"$f":"IF($P$12=12,\"X\",\"\")","v":""}]
[null,null,null,null,null,null,null,"N","|","|",null,"|","|","|","|",null,"6x 2 TB 2,5\" U.3 NVMe SSD",null,{"$f":"IF($P$12=13,\"X\",\"\")","v":""}]
[null,null,null,null,null,null,null,"X","|","|",null,"|","|","|","|",null,"without drives",null,{"$f":"IF($P$12=14,\"X\",\"\")","v":""}]
[null,null,null,null,null,null,null,null,"|","|",null,"|","|","|","|"]
[null,null,null,null,null,null,null,null,"|","|",null,"|","|","|","|",null,"Drives internal M.2 for OS"]
[null,null,null,null,null,null,null,null,0,"|",null,"|","|","|","|",null,"1x 1 TB SSD M.2 NVMe",null,{"$f":"IF($P$13=1,\"X\",\"\")","v":"X"}]
[null,null,null,null,null,null,null,null,1,"|",null,"|","|","|","|",null,"1x 2 TB SSD M.2 NVMe",null,{"$f":"IF($P$13=2,\"X\",\"\")","v":""}]
[null,null,null,null,null,null,null,null,null,"|",null,"|","|","|","|"]
[null,null,null,null,null,null,null,null,null,"|",null,"|","|","|","|",null,"Main memory"]
[null,null,null,null,null,null,null,null,null,0,null,"|","|","|","|",null,"256 GB DDR5-4800MHz RDIMM ECC",null,{"$f":"IF($P$14=1,\"X\",\"\")","v":"X"}]
[null,null,null,null,null,null,null,null,null,1,null,"|","|","|","|",null,"512 GB DDR5-4800MHz RDIMM ECC",null,{"$f":"IF($P$14=2,\"X\",\"\")","v":""}]
[null,null,null,null,null,null,null,null,null,2,null,"|","|","|","|",null,"1 TB DDR5-4800MHz RDIMM ECC",null,{"$f":"IF($P$14=3,\"X\",\"\")","v":""}]
[null,null,null,null,null,null,null,null,null,3,null,"|","|","|","|",null,"1.5 TB DDR5-4800MHz RDIMM ECC",null,{"$f":"IF($P$14=4,\"X\",\"\")","v":""}]
[null,null,null,null,null,null,null,null,null,null,null,"|","|","|","|"]
[null,null,null,null,null,null,null,null,null,null,null,"|","|","|","|",null,"Extension Cards"]
[null,null,null,null,null,null,null,null,null,null,null,0,"|","|","|",null,"without extension card",null,{"$f":"IF($P$15=1,\"X\",\"\")","v":"X"}]
[null,null,null,null,null,null,null,null,null,null,null,1,"|","|","|",null,"Network adapter Intel X710 (2x 10GB LAN, RJ45) PCIe x8 (1 Slot occupied)",null,{"$f":"IF($P$15=2,\"X\",\"\")","v":""}]
[null,null,null,null,null,null,null,null,null,null,null,null,"|","|","|"]
[null,null,null,null,null,null,null,null,null,null,null,null,"|","|","|",null,"AI Accelerator"]
[null,null,null,null,null,null,null,null,null,null,null,null,"A","|","|",null,"AI Accelerator 1x NVIDIA L4 (1 Slot occupied)",null,{"$f":"IF($P$16=1,\"X\",\"\")","v":""}]
[null,null,null,null,null,null,null,null,null,null,null,null,"B","|","|",null,"AI Accelerator 2x NVIDIA L4 (2 Slot occupied)",null,{"$f":"IF($P$16=2,\"X\",\"\")","v":""}]
[null,{"$f":"IF(AND(OR($P$11=7,$P$11=8,$P$11=9,$P$11=10,$P$11=11,$P$11=12,),$P$16=4),1,0)","v":0},"The selected combination is not valid: PCIe x8 RAID controller only with Windows server OS or Windows 7, 64Bit"," .",null,null,null,null,null,null,null,null,"C","|","|",null,"AI Accelerator 3x NVIDIA L4 (3 Slot occupied)",null,{"$f":"IF($P$16=3,\"X\",\"\")","v":""}]
[null,{"$f":"IF(AND(OR($P$12=17,$P$12=18,$P$12=19,$P$12=20,),$P$16=5),1,0)","v":0},"The selected combination is not valid: PCIe x8 RAID controller only with Windows server OS or Windows 7, 64Bit"," .",null,null,null,null,null,null,null,null,"D","|","|",null,"AI Accelerator 4x NVIDIA L4 (4 Slot occupied)",null,{"$f":"IF($P$16=4,\"X\",\"\")","v":""}]
[null,null,null,null,null,null,null,null,null,null,null,null,"E","|","|",null,"AI Accelerator 1x NVIDIA L40 (2 Slot occupied)",null,{"$f":"IF($P$16=5,\"X\",\"\")","v":""}]
[null,null,null,null,null,null,null,null,null,null,null,null,"F","|","|",null,"AI Accelerator 2x NVIDIA L40 (4 Slot occupied)",null,{"$f":"IF($P$16=6,\"X\",\"\")","v":""}]
[null,null,null,null,null,null,null,null,null,null,null,null,"G","|","|",null,"AI Accelerator 1x NVIDIA A100 (2 Slot occupied)",null,{"$f":"IF($P$16=7,\"X\",\"\")","v":""}]
[null,null,null,null,null,null,null,null,null,null,null,null,"H","|","|",null,"AI Accelerator 2x NVIDIA A100 (4 Slot occupied)",null,{"$f":"IF($P$16=8,\"X\",\"\")","v":""}]
[null,null,null,null,null,null,null,null,null,null,null,null,"J","|","|",null,"AI Accelerator 1x NVIDIA H100 (2 Slot occupied)",null,{"$f":"IF($P$16=9,\"X\",\"\")","v":""}]
[null,null,null,null,null,null,null,null,null,null,null,null,"K","|","|",null,"AI Accelerator 2x NVIDIA H100 (4 Slot occupied)",null,{"$f":"IF($P$16=10,\"X\",\"\")","v":""}]
[null,null,null,null,null,null,null,null,null,null,null,null,"X","|","|",null,"without AI Accelerator",null,{"$f":"IF($P$16=11,\"X\",\"\")","v":"X"}]
[null,null,null,null,null,null,null,null,null,null,null,null,null,"|","|"]
[null,null,null,null,null,null,null,null,null,null,null,null,null,"|","|",null,"Operating system (pre-installed and activated)"]
[null,null,null,null,null,null,null,null,null,null,null,null,null,{"$f":"IF(NOT($P$11=1),\"!\",\"A\")","v":"A"},"|",null,"Windows Server 2022 IoT Standard Edition incl. unlimited Clients for this server, 64bit, MUI (en, de, fr, it, sp), for 32 Cores",null,{"$f":"IF($P$17=1,\"X\",\"\")","v":""}]
[null,null,null,null,null,null,null,null,null,null,null,null,null,{"$f":"IF(NOT($P$11=2),\"!\",\"B\")","v":"!"},"|",null,"Windows Server 2022 IoT Standard Edition incl. unlimited Clients for this server, 64bit, MUI (en, de, fr, it, sp), for 48 Cores",null,{"$f":"IF($P$17=2,\"X\",\"\")","v":""}]
[null,null,null,null,null,null,null,null,null,null,null,null,null,{"$f":"IF(NOT($P$11=3),\"!\",\"C\")","v":"!"},"|",null,"Windows Server 2022 IoT Standard Edition incl. unlimited Clients for this server, 64bit, MUI (en, de, fr, it, sp), for 64 Cores",null,{"$f":"IF($P$17=3,\"X\",\"\")","v":""}]
[null,null,null,null,null,null,null,null,null,null,null,null,null,{"$f":"IF(NOT($P$11=4),\"!\",\"D\")","v":"!"},"|",null,"Windows Server 2022 IoT Standard Edition incl. unlimited Clients for this server, 64bit, MUI (en, de, fr, it, sp), for 96 Cores",null,{"$f":"IF($P$17=4,\"X\",\"\")","v":""}]
[null,null,null,null,null,null,null,null,null,null,null,null,null,"X","|",null,"without operating system",null,{"$f":"IF($P$17=5,\"X\",\"\")","v":"X"}]
[null,null,null,null,null,null,null,null,null,null,null,null,null,null,"|"]
[null,null,null,null,null,null,null,null,null,null,null,null,null,null,"|",null,"Power Supply + Power cords country specific"]
[null,null,null,null,null,null,null,null,null,null,null,null,null,null,0,null,"power supply 2600 W (2 Module à 2600 W, redundant) - without power cords",null,{"$f":"IF($P$18=1,\"X\",\"\")","v":"X"}]
[null,null,null,null,null,null,null,null,null,null,null,null,null,null,1,null,"power supply 2600 W (2 Module à 2600 W, redundant) - power cords Europe",null,{"$f":"IF($P$18=2,\"X\",\"\")","v":""}]
[null,null,null,null,null,null,null,null,null,null,null,null,null,null,2,null,"power supply 2600 W (2 Module à 2600 W, redundant) - power cords USA",null,{"$f":"IF($P$18=3,\"X\",\"\")","v":""}]
[null,null,null,null,null,null,null,null,null,null,null,null,null,null,3,null,"power supply 2600 W (2 Module à 2600 W, redundant)  - power cords China",null,{"$f":"IF($P$18=4,\"X\",\"\")","v":""}]
[]
[null,null,null,null,null,null,null,null,null,null,null,null,null,null,null,null," IPC base ",null,"X"]
[]
[{"$f":"A$5","v":"6AG4"},1,0,2,"-",0,{"$f":"G5","v":"A"},{"$f":"H5","v":"A"},{"$f":"I5","v":0},{"$f":"J5","v":0},"-",{"$f":"L5","v":0},{"$f":"M5","v":"X"},{"$f":"N5","v":"X"},{"$f":"O5","v":0}]
[]
[]
["Accessories:"]

{"sheet":"IPC127E (Box)","index":10,"n_rows":50,"n_cols":21,"rows_kept":50,"cut":false,"hidden":false,"merged":[]}
["SIMATIC IPC127E",null,null,null,null,null,null,null,null,null,null,null,null,null,null,null,"Prodotto vicino al Phase-Out ==> Successore BX-21A",null,null,null,"."]
[]
[null,null,null,null,null,null,null,null,null,null,null,null,null,null,null,null,{"$f":"IF(F24,G24,\"\")&IF(F25,G25,\"\")&IF(F26,G26,\"\")","v":""}]
[{"$f":"+A42","v":""},null,null,null,null,null,null,null,null,null,null,null,null,null,null,null,{"$f":"IF(F35,G35,\"\")&IF(F36,G36,\"\")","v":""}]
["6AG4",0,2,1,"-",0,"A",{"$f":"IF(P6=1,H13,)&IF(P6=2,H14,)&IF(P6=3,H15,)&IF(P6=4,H16,)","v":"A"},1,{"$f":"IF(P7=1,J19,)&IF(P7=2,J20,)","v":"1"},"-",{"$f":"IF(P8=1,L23,)&IF(P8=2,L24,)&IF(P8=3,L25,)&IF(P8=4,L26,)","v":"0"},{"$f":"IF(P9=1,M29,)&IF(P9=2,M30,)&IF(P9=3,M31,)","v":"A"},{"$f":"IF(P10=1,N34,)&IF(P10=2,N35,)&IF(P10=3,N36,)","v":"A"},0,null,{"$f":"A1","v":"SIMATIC IPC127E"},{"$f":"$A$5&$B$5&$C$5&$D$5&$E$5&$F$5&$G$5&$H$5&$I$5&$J$5&$K$5&$L$5&$M$5&$N$5&$O$5","v":"6AG4021-0AA11-0AA0"}]
[null,null,null,null,null,null,null,"|",null,"|",null,"|","|","|",null,1,{"$f":"IF(P6=1,Q13,)&IF(P6=2,Q14,)&IF(P6=3,Q15,)&IF(P6=4,Q16,)","v":"Atom E3930 (2C/2T) / 2 GB RAM"}]
[null,null,null,null,null,null,null,"|",null,"|",null,"|","|","|",null,1,{"$f":"IF(P7=1,Q19,)&IF(P7=2,Q20,)","v":"Base"},"Link utili"]
[null,null,null,null,null,null,{"$f":"IF(P8=12,#REF!,IF(P8=13,#REF!,IF(P8=15,#REF!,IF(P8=16,#REF!,IF(P8=17,#REF!,\"\")))))","v":""},"|",null,"|",null,"|","|","|",null,1,{"$f":"IF(P8=1,Q23,)&IF(P8=2,Q24,)&IF(P8=3,Q25,)&IF(P8=4,Q26,)","v":"without operating system"},"Certificati"]
[null,null,null,null,null,null,null,"|",null,"|",null,"|","|","|",null,1,{"$f":"IF(P9=1,Q29,)&IF(P9=2,Q30,)&IF(P9=3,Q31,)","v":"32 GB SSD"},"Datasheet"]
[null,null,null,null,null,null,null,"|",null,"|",null,"|","|","|",null,1,{"$f":"IF(P10=1,Q34,)&IF(P10=2,Q35,)&IF(P10=3,Q36,)","v":"without SIMATIC software"},"Manuale"]
[null,null,null,null,null,null,null,"|",null,"|",null,"|","|","|",null,null,null,"CAD 2D/3D"]
[null," ",null,null,null,null,null,"|",null,"|",null,"|","|","|",null,null,"Processor / RAM / TPM"]
[null,null,null,null,null,null,null,"A",null,"|",null,"|","|","|",null,null,"Atom E3930 (2C/2T) / 2 GB RAM",null,{"$f":"IF($P$6=1,\"X\",\"\")","v":"X"}]
[null,null,null,null,null,null,null,"B",null,"|",null,"|","|","|",null,null,"Atom E3940 (4C/4T) / 4 GB RAM",null,{"$f":"IF($P$6=2,\"X\",\"\")","v":""}]
[null,null,null,null,null,null,null,"C",null,"|",null,"|","|","|",null,null,"Atom E3930 (2C/2T) / 2 GB RAM / TPM",null,{"$f":"IF($P$6=3,\"X\",\"\")","v":""}]
[null,null,null,null,null,null,null,"D",null,"|",null,"|","|","|",null,null,"Atom E3940 (4C/4T) / 4 GB RAM / TPM",null,{"$f":"IF($P$6=4,\"X\",\"\")","v":""}]
[null,null,null,null,null,null,null,null,null,"|",null,"|","|","|"]
[null,null,null,null,null,null,null,null,null,"|",null,"|","|","|",null,null,"Box Type"]
[null,null,null,null,null,null,null,null,null,1,null,"|","|","|",null,null,"Base",null,{"$f":"IF($P$7=1,\"X\",\"\")","v":"X"}]
[null,null,null,null,null,null,null,null,null,2,null,"|","|","|",null,null,"Extended",null,{"$f":"IF($P$7=2,\"X\",\"\")","v":""}]
[null,null,null,null,null,null,null,null,null,null,null,"|","|","|"]
[null,null,null,null,null,null,null,null,null,null,null,"|","|","|",null,null,"Operating system"]
[null,null,null,null,null,null,null,null,null,null,null,0,"|","|",null,null,"without operating system",null,{"$f":"IF($P$8=1,\"X\",\"\")","v":"X"}]
[null,null,null,null,null,{"$f":"IF(AND($P$8=2,$P$9=1),1,0)","v":0},"Windows 10 only with SSD >= 64 GB"," ",null,null,null,1,"|","|",null,null,"Windows 10 IoT Enterprise 2016 LTSB, 64Bit, MUI (Ger, En, Es, Fr, It)",null,{"$f":"IF($P$8=2,\"X\",\"\")","v":""}]
[null,null,null,null,null,{"$f":"IF(AND($P$8=3,$P$9=1),1,0)","v":0},"Windows 10 only with SSD >= 64 GB"," ",null,null,null,2,"|","|",null,null,"Windows 10 IoT Enterprise 2019 LTSC, 64Bit, MUI (Ger, En, Es, Fr, It)",null,{"$f":"IF($P$8=3,\"X\",\"\")","v":""}]
[null,null,null,null,null,{"$f":"IF(AND($P$8=4,$P$9=1),1,0)","v":0},"Windows 10 only with SSD >= 64 GB"," ",null,null,null,3,"|","|",null,null,"Windows 10 IoT Enterprise 2021 LTSC, 64Bit, MUI (Ger, En, Es, Fr, It)",null,{"$f":"IF($P$8=4,\"X\",\"\")","v":""}]
[null,null,null,null,null,null,null,null,null,null,null,null,"|","|"]
[null,null,null,null,null,null,null,null,null,null,null,null,"|","|",null,null,"Drive"]
[null,null,null,null,null,null,null,null,null,null,null,null,"A","|",null,null,"32 GB SSD",null,{"$f":"IF($P$9=1,\"X\",\"\")","v":"X"}]
[null,null,null,null,null,null,null,null,null,null,null,null,"B","|",null,null,"64 GB SSD",null,{"$f":"IF($P$9=2,\"X\",\"\")","v":""}]
[null,null,null,null,null,null,null,null,null,null,null,null,"C","|",null,null,"128 GB SSD",null,{"$f":"IF($P$9=3,\"X\",\"\")","v":""}]
[null,null,null,null,null,null,null,null,null,null,null,null,null,"|"]
[null,null,null,null,null,null,null,null,null,null,null,null,null,"|",null,null,"without SIMATIC software"]
[null,null,null,null,null,null,null,null,null,null,null,null,null,"A",null,null,"without SIMATIC software",null,{"$f":"IF($P$10=1,\"X\",\"\")","v":"X"}]
[null,null,null,null,null,{"$f":"IF(AND(($P$10=2),OR(($P$6<4),($P$8>1),($P$9<3))),1,0)","v":0},"Industrial Edge SIMATIC only with: E3940/4 GB RAM/TPM / w/o Operating System / 128 GB SSD",null,null,null,null,null,null,"B",null,null,"Industrial Edge - SIMATIC",null,{"$f":"IF($P$10=2,\"X\",\"\")","v":""}]
[null,null,null,null,null,{"$f":"IF(AND(($P$10=3),OR(($P$6<4),($P$7>1),($P$8>1),($P$9<3))),1,0)","v":0},"Industrial Edge SINUMERIK only with: E3940/4 GB RAM/TPM / Base-variant / w/o Operating System / 128 GB SSD",null,null,null,null,null,null,"C",null,null,"Industrial Edge - SINUMERIK",null,{"$f":"IF($P$10=3,\"X\",\"\")","v":""}]
[]
[]
[null,null,null,null,null,null,null,null,null,null,null,null,null,null,null,null,"Base version",null,"X"]
[]
["6AG4",0,2,1," - ",{"$f":"F5","v":0},"A","A",1,"1","-","0","A","A",0,null,null,"Total:"]
[{"$f":"IF(ISNONTEXT(VLOOKUP(R5,$A$54:$A$79,1,)),\"\",#REF!)","v":""}]
[]
["Mounting accessories"]
[]
["6AG4021-0AA20-0AA1",null,null,null,null,null,null,null,null,null,null,null,null,null,null,null,"DIN-Rail"]
["6AG4021-0AA20-0AA2",null,null,null,null,null,null,null,null,null,null,null,null,null,null,null,"Wall-mount"]
["6AG4021-0AA20-0AA3",null,null,null,null,null,null,null,null,null,null,null,null,null,null,null,"Book-mount Base"]
["6AG4021-0AA20-0AA4",null,null,null,null,null,null,null,null,null,null,null,null,null,null,null,"Book-mount Extended"]
["6AG4021-0AA20-0AA5",null,null,null,null,null,null,null,null,null,null,null,null,null,null,null,"Book-mount DIN-Rail"]

{"sheet":"IPC BX-21A (Box)","index":11,"n_rows":40,"n_cols":21,"rows_kept":40,"cut":false,"hidden":false,"merged":[]}
["SIMATIC IPC BX-21A",null,null,null,null,null,null,null,null,null,null,null,null,null,null,null,null,null,null,null,"."]
[null,null,null,null,null,null,null,null,null,null,null,null,null,null,null,null,"Gli accessori di montaggio vanno ordinati a parte"]
[]
[]
["6AG4",0,2,1,"-",0,"B",{"$f":"IF(P6=1,H13,)&IF(P6=2,H14,)","v":"C"},0,0,"-",{"$f":"IF(P7=1,L17,)&IF(P7=2,L18,)&IF(P7=3,#REF!,)&IF(P7=4,#REF!,)","v":"1"},"A",{"$f":"IF(P8=1,N21,)&IF(P8=2,N22,)&IF(P8=3,#REF!,)&IF(P8=4,#REF!,)","v":"A"},{"$f":"IF(P9=1,O25,)&IF(P9=2,O26,)","v":"1"},null,{"$f":"A1","v":"SIMATIC IPC BX-21A"},{"$f":"$A$5&$B$5&$C$5&$D$5&$E$5&$F$5&$G$5&$H$5&$I$5&$J$5&$K$5&$L$5&$M$5&$N$5&$O$5","v":"6AG4021-0BC00-1AA1"}]
[null,null,null,null,null,null,null,"|",null,null,null,"|",null,"|","|",1,{"$f":"IF(P6=1,Q13,)&IF(P6=2,Q14,)","v":"Atom X6413E (4-Core) / 8 GB RAM"}]
[null,null,null,null,null,null,null,"|",null,null,null,"|",null,"|","|",1,{"$f":"IF(P7=1,Q17,)&IF(P7=2,Q18,)&IF(P7=3,#REF!,)&IF(P7=4,#REF!,)","v":"128 GB Eco SSD"},"Link utili"]
[null,null,null,null,null,null,null,"|",null,null,null,"|",null,"|","|",1,{"$f":"IF(P8=1,Q21,)&IF(P8=2,Q22,)&IF(P8=3,#REF!,)&IF(P8=4,#REF!,)","v":"without operating system"},"Certificati"]
[null,null,null,null,null,null,null,"|",null,null,null,"|",null,"|","|",1,{"$f":"IF(P9=1,Q25,)&IF(P9=2,Q26,)","v":"without USB-Stick (Restore-Image; D&D)"},"Datasheet"]
[null,null,null,null,null,null,null,"|",null,null,null,"|",null,"|","|",null,null,"Manuale"]
[null,null,null,null,null,null,null,null,null,null,null,null,null,null,null,null,null,"CAD 2D/3D"]
[null,null,null,null,null,null,null,"|",null,null,null,"|",null,"|","|",null,"Processor / RAM"]
[null,null,null,null,null,null,null,"C",null,null,null,"|",null,"|","|",null,"Atom X6413E (4-Core) / 8 GB RAM",null,{"$f":"IF($P$6=1,\"X\",\"\")","v":"X"}]
[null,null,null,null,null,null,null,"D",null,null,null,"|",null,"|","|",null,"Atom X6413E (4-Core) / 16 GB RAM",null,{"$f":"IF($P$6=2,\"X\",\"\")","v":""}]
[null,null,null,null,null,null,null,null,null,null,null,"|",null,"|","|"]
[null,null,null,null,null,null,null,null,null,null,null,"|",null,"|","|",null,"Drive"]
[null,null,null,null,null,null,null,null,null,null,null,1,null,"|","|",null,"128 GB Eco SSD",null,{"$f":"IF($P$7=1,\"X\",\"\")","v":"X"}]
[null,null,null,null,null,null,null,null,null,null,null,2,null,"|","|",null,"256 GB Eco SSD",null,{"$f":"IF($P$7=2,\"X\",\"\")","v":""}]
[null,null,null,null,null,null,null,null,null,null,null,null,null,"|","|"]
[null,null,null,null,null,null,null,null,null,null,null,null,null,"|","|",null,"Operating system"]
[null,null,null,null,null,null,null,null,null,null,null,null,null,"A","|",null,"without operating system",null,{"$f":"IF($P$8=1,\"X\",\"\")","v":"X"}]
[null,null,null,null,null,null,null," ",null,null,null,null,null,"B","|",null,"Windows 10 IoT Enterprise 2021 LTSC, 64Bit, MUI (Ger, En, Es, Fr, It)",null,{"$f":"IF($P$8=2,\"X\",\"\")","v":""}]
[null,null,null,null,null,null,null,null,null,null,null,null,null,null,"|"]
[null,null,null,null,null,null,null,null,null,null,null,null,null,null,"|",null,"USB-Stick"]
[null,null,null,null,null,null,null,null,null,null,null,null,null,null,1,null,"without USB-Stick (Restore-Image; D&D)",null,{"$f":"IF($P$9=1,\"X\",\"\")","v":"X"}]
[null,null,null,null,null,null,null,null,null,null,null,null,null,null,2,null,"with USB-Stick (Restore-Image; D&D)",null,{"$f":"IF($P$9=2,\"X\",\"\")","v":""}]
[]
[]
[null,null,null,null,null,null,null,null,null,null,null,null,null,null,null,null,"Base version",null,"X"]
[null,null,null,null,null,null,null,null,null,null,null,null,null,null,null,null,null,"Total:"]
["6AG4",0,2,1," - ",{"$f":"F5","v":0},"B","C",0,0,"-","1","A","A","1"]
[]
[]
["Mounting accessories"]
[]
["6AG4021-0AA20-0AA1",null,null,null,null,null,null,null,null,null,null,null,null,null,null,null,"DIN-Rail"]
["6AG4021-0AA20-0AA2",null,null,null,null,null,null,null,null,null,null,null,null,null,null,null,"Wall-mount"]
["6AG4021-0AA20-0AA3",null,null,null,null,null,null,null,null,null,null,null,null,null,null,null,"Book-mount Base"]
["6AG4021-0AA20-0AA4",null,null,null,null,null,null,null,null,null,null,null,null,null,null,null,"Book-mount Extended"]
["6AG4021-0AA20-0AA5",null,null,null,null,null,null,null,null,null,null,null,null,null,null,null,"Book-mount DIN-Rail"]

{"sheet":"IPC227E (Nanobox)","index":12,"n_rows":85,"n_cols":19,"rows_kept":85,"cut":false,"hidden":false,"merged":[]}
["SIMATIC IPC227E  (Nanobox PC)",null,null,null,null,null,null,null,null,null,null,null,null,null,null,null,"Prodotto superato da IPC 227G"]
[null,null,null,null,null,null,null,null,null,null,null,null,null,null,null,null,{"$f":"IF(D21,E21,\"\")&IF(D30,E30,\"\")&IF(D54,E54,\"\")","v":""}]
[null,null,null,null,null,null,null,null,null,null,null,null,null,null,null,null,{"$f":"IF(F40,G40,\"\")&IF(F41,G41,\"\")&IF(F42,G42,\"\")&IF(F43,G43,\"\")&IF(F44,G44,\"\")&IF(F45,G45,\"\")&IF(F46,G46,\"\")&IF(F47,G47,\"\")","v":""}]
[null,null,null,null,null,null,null,null,null,null,null,null,null,null,null,null,{"$f":"IF(F63,G63,\"\")&IF(F64,G64,\"\")&IF(F65,G65,\"\")","v":""}]
["6ES7",6,4,7,"-",8,"B",{"$f":"IF(P6=1,H17,)&IF(P6=2,H18,)&IF(P6=3,H19,)&IF(P6=4,H20,)&IF(P6=5,H21,)","v":"A"},{"$f":"IF(P7=1,I24,)&IF(P7=2,I25,)&IF(P7=3,I26,)&IF(P7=4,I27,)&IF(P7=5,I28,)&IF(P7=6,I29,)&IF(P7=7,I30,)","v":"1"},{"$f":"IF(P8=1,J33,)&IF(P8=2,J34,)&IF(P8=3,J35,)&IF(P8=4,J36,)","v":"1"},"-",{"$f":"IF(P9=1,L39,)&IF(P9=2,L40,)&IF(P9=3,L41,)&IF(P9=4,L42,)&IF(P9=5,L43,)&IF(P9=6,L44,)&IF(P9=7,L45,)&IF(P9=8,L46,)&IF(P9=9,L47,)","v":"0"},{"$f":"IF(P10=1,M50,)&IF(P10=2,M51,)&IF(P10=3,M52,)&IF(P10=4,M53,)&IF(P10=5,M54,)&IF(P10=6,M55,)&IF(P10=7,M56,)&IF(P10=8,M57,)&IF(P10=9,M58,)&IF(P10=10,M59,)","v":"D"},{"$f":"IF(P11=1,N62,)&IF(P11=2,N63,)&IF(P11=3,N64,)&IF(P11=4,N65,)","v":"A"},{"$f":"IF(P12=1,O68,)&IF(P12=2,O69,)&IF(P12=3,O70,)&IF(P12=4,O71,)&IF(P12=5,O72,)&IF(P12=6,O73,)&IF(P12=7,O74,)","v":"1"},null,{"$f":"\"SIMATIC IPC227E  (Nanobox PC)\"","v":"SIMATIC IPC227E  (Nanobox PC)"},{"$f":"$A$5&$B$5&$C$5&$D$5&$E$5&$F$5&$G$5&$H$5&$I$5&$J$5&$K$5&$L$5&$M$5&$N$5&$O$5","v":"6ES7647-8BA11-0DA1"}]
[null,null,null,null,null,null,null,"|","|","|",null,"|","|","|","|",1,{"$f":"IF(P6=1,Q17,)&IF(P6=2,Q18,)&IF(P6=3,Q19,)&IF(P6=4,Q20,)&IF(P6=5,Q21,)","v":"Celeron N2807 (2C/2T)"}]
[null,null,null,null,null,null,null,"|","|","|",null,"|","|","|","|",1,{"$f":"IF(P7=1,Q24,)&IF(P7=2,Q25,)&IF(P7=3,Q26,)&IF(P7=4,Q27,)&IF(P7=5,Q28,)&IF(P7=6,Q29,)&IF(P7=7,Q30,)","v":"2 GB RAM"}]
[null,null,null,null,null,null,null,"|","|","|",null,"|","|","|","|",1,{"$f":"IF(P8=1,Q33,)&IF(P8=2,Q34,)&IF(P8=3,Q35,)&IF(P8=4,Q36,)","v":"Box: Base / without COM"},"Link utili"]
[null,null,null,null,null,null,{"$f":"IF(P9=12,#REF!,IF(P9=13,#REF!,IF(P9=15,#REF!,IF(P9=16,#REF!,IF(P9=17,#REF!,\"\")))))","v":""},"|","|","|",null,"|","|","|","|",1,{"$f":"IF(P9=1,Q39,)&IF(P9=2,Q40,)&IF(P9=3,Q41,)&IF(P9=4,Q42,)&IF(P9=5,Q43,)&IF(P9=6,Q44,)&IF(P9=7,Q45,)&IF(P9=8,Q46,)&IF(P9=9,Q47,)","v":"without Windows operating system"},"Certificati"]
[null,null,null,null,null,null,null,"|","|","|",null,"|","|","|","|",3,{"$f":"IF(P10=1,Q50,)&IF(P10=2,Q51,)&IF(P10=3,Q52,)&IF(P10=4,Q53,)&IF(P10=5,Q54,)&IF(P10=6,Q55,)&IF(P10=7,Q56,)&IF(P10=8,Q57,)&IF(P10=9,Q58,)&IF(P10=10,Q59,)","v":"480 GB SSD"},"Datasheet"]
[null,null,null,null,null,null,null,"|","|","|",null,"|","|","|","|",1,{"$f":"IF(P11=1,Q62,)&IF(P11=2,Q63,)&IF(P11=3,Q64,)&IF(P11=4,Q65,)","v":"without SIMATIC Software"},"Manuale"]
[null,null,null,null,null,null,null,"|","|","|",null,"|","|","|","|",1,{"$f":"IF(P12=1,Q68,)&IF(P12=2,Q69,)&IF(P12=3,Q70,)&IF(P12=4,Q71,)&IF(P12=5,Q72,)&IF(P12=6,Q73,)","v":"DIN-Rail"},"CAD 2D/3D"]
[null,null,null,null,null,null,null,"|","|","|",null,"|","|","|","|"]
[null,null,null,null,null,null,null,"|","|","|",null,"|","|","|","|"]
[null,null,null,null,null,null,null,"|","|","|",null,"|","|","|","|"]
[null," ",null,null,null,null,null,"|","|","|",null,"|","|","|","|",null,"Processor / TPM"]
[null,null,null,null,null,null,null,"A","|","|",null,"|","|","|","|",null,"Celeron N2807 (2C/2T)",null,{"$f":"IF($P$6=1,\"X\",\"\")","v":"X"}]
[null,null,null,null,null,null,null,"B","|","|",null,"|","|","|","|",null,"Celeron N2930 (4C/4T)",null,{"$f":"IF($P$6=2,\"X\",\"\")","v":""}]
[null,null,null,null,null,null,null,"C","|","|",null,"|","|","|","|",null,"Celeron N2807 (2C/2T) / TPM",null,{"$f":"IF($P$6=3,\"X\",\"\")","v":""}]
[null,null,null,null,null,null,null,"D","|","|",null,"|","|","|","|",null,"Celeron N2930 (4C/4T) / TPM",null,{"$f":"IF($P$6=4,\"X\",\"\")","v":""}]
[null,null,null,{"$f":"IF(AND(($P$6=5),OR(($P$7<7),($P$8>2),($P$10=2),($P$10=3),($P$10=4),($P$10=6),($P$10=7),($P$10=8),($P$10=9),($P$10=10),($P$12>3))),1,0)","v":0},"ET-variant only with: Celeron E3845 ET / 4 GB RAM ET / w/o mass storage or 60 GB SSD ET; w/o PCIe-variants; w/o ATEX/IECEx/cULus options"," ",null,"E","|","|",null,"|","|","|","|",null,"Atom E3845 ET (4C/4T) / TPM",null,{"$f":"IF($P$6=5,\"X\",\"\")","v":""}]
[null,null,null,null,null,null,null,null,"|","|",null,"|","|","|","|"]
[null,null,null,null,null,null,null,null,"|","|",null,"|","|","|","|",null,"RAM / NVRAM"]
[null,null,null,null,null,null,null,null,1,"|",null,"|","|","|","|",null,"2 GB RAM",null,{"$f":"IF($P$7=1,\"X\",\"\")","v":"X"}]
[null,null,null,null,null,null,null,null,2,"|",null,"|","|","|","|",null,"4 GB RAM",null,{"$f":"IF($P$7=2,\"X\",\"\")","v":""}]
[null,null,null,null,null,null,null,null,3,"|",null,"|","|","|","|",null,"8 GB RAM",null,{"$f":"IF($P$7=3,\"X\",\"\")","v":""}]
[null,null,null,null,null,null,null,null,4,"|",null,"|","|","|","|",null,"2 GB RAM / NVRAM",null,{"$f":"IF($P$7=4,\"X\",\"\")","v":""}]
[null,null,null,null,null,null,null,null,5,"|",null,"|","|","|","|",null,"4 GB RAM / NVRAM",null,{"$f":"IF($P$7=5,\"X\",\"\")","v":""}]
[null,null,null,null,null,null,null,null,6,"|",null,"|","|","|","|",null,"8 GB RAM / NVRAM",null,{"$f":"IF($P$7=6,\"X\",\"\")","v":""}]
[null,null,null,{"$f":"IF(AND(($P$7=7),OR(($P$6<5),($P$8>2),($P$10=2),($P$10=3),($P$10=4),($P$10=6),($P$10=7),($P$10=8),($P$10=9),($P$10=10),($P$12>3))),1,0)","v":0},"ET-variant only with: Celeron E3845 ET / 4 GB RAM ET / w/o mass storage or 60 GB SSD ET; w/o PCIe-variants; w/o ATEX/IECEx/cULus options"," ",null,null,7,"|",null,"|","|","|","|",null,"4 GB RAM ET / NVRAM",null,{"$f":"IF($P$7=7,\"X\",\"\")","v":""}]
[null,null,null,null,null,null,null,null,null,"|",null,"|","|","|","|"]
[null,null,null,null,null,null,null,null,null,"|",null,"|","|","|","|",null,"Box type / COM Interface"]
[null,null,null,null,null,null,null,null,null,1,null,"|","|","|","|",null,"Box: Base / without COM",null,{"$f":"IF($P$8=1,\"X\",\"\")","v":"X"}]
[null,null,null,null,null,null,null,null,null,2,null,"|","|","|","|",null,"Box: Base / with COM1/2",null,{"$f":"IF($P$8=2,\"X\",\"\")","v":""}]
[null,null,null,null,null,null,null,null,null,3,null,"|","|","|","|",null,"Box: PCIe / without COM",null,{"$f":"IF($P$8=3,\"X\",\"\")","v":""}]
[null,null,null,null,null,null,null,null,null,4,null,"|","|","|","|",null,"Box: PCIe / with COM1/2",null,{"$f":"IF($P$8=4,\"X\",\"\")","v":""}]
[null,null,null,null,null,null,null,null,null,null,null,"|","|","|","|"]
[null,null,null,null,null,null,null,null,null,null,null,"|","|","|","|",null,"Operating system"]
[null,null,null,null,null,null,null,null,null,null,null,0,"|","|","|",null,"without Windows operating system",null,{"$f":"IF($P$9=1,\"X\",\"\")","v":"X"}]
[null,null,null,null,null,{"$f":"IF(OR(AND($P$9=2,$P$10=1),AND($P$9=2,$P$10=6)),1,0)","v":0},"WES7E (32/64 bit) with SSD, HDD or CFast from 8 GB"," ",null,null,null,1,"|","|","|",null,"Windows Embedded Standard 7 E SP1, english, 32Bit",null,{"$f":"IF($P$9=2,\"X\",\"\")","v":""}]
[null,null,null,null,null,{"$f":"IF(OR(AND($P$9=3,$P$10=1),AND($P$9=3,$P$10=6),AND($P$9=3,$P$10=7)),1,0)","v":0},"WES7P (32 bit) with SSD, HDD or CFast from 16 GB"," ",null,null,null,2,"|","|","|",null,"Windows Embedded Standard 7 E SP1, english, 64Bit",null,{"$f":"IF($P$9=3,\"X\",\"\")","v":""}]
[null,null,null,null,null,{"$f":"IF(OR(AND($P$9=4,$P$10=1),AND($P$9=4,$P$10=6),AND($P$9=4,$P$10=7)),1,0)","v":0},"WES7P (32 bit) with SSD, HDD or CFast from 16 GB"," ",null,null,null,3,"|","|","|",null,"Windows Embedded Standard 7 P SP1, MUI, 32Bit",null,{"$f":"IF($P$9=4,\"X\",\"\")","v":""}]
[null,null,null,null,null,{"$f":"IF(OR(AND($P$9=5,$P$10=1),AND($P$9=5,$P$10=6),AND($P$9=5,$P$10=7)),1,0)","v":0},"WES7P (64 bit) with SSD, HDD or CFast from 16 GB"," ",null,null,null,4,"|","|","|",null,"Windows Embedded Standard 7 P SP1, MUI, 64Bit",null,{"$f":"IF($P$9=5,\"X\",\"\")","v":""}]
[null,null,null,null,null,{"$f":"IF(AND($L$5=\"5\",OR($M$5=\"A\",$M$5=\"K\",$M$5=\"L\",$M$5=\"M\",$M$5=\"N\",)),1,0)","v":0},"W7 only with SSD / HDD"," ",null,null,null,5,"|","|","|",null,"Windows7 Ultimate SP1, 32Bit, MUI (En, Ger, Es, Fr, It)",null,{"$f":"IF($P$9=6,\"X\",\"\")","v":""}]
[null,null,null,null,null,{"$f":"IF(AND($L$5=\"6\",OR($M$5=\"A\",$M$5=\"K\",$M$5=\"L\",$M$5=\"M\",$M$5=\"N\",)),1,0)","v":0},"W7 only with SSD / HDD"," ",null,null,null,6,"|","|","|",null,"Windows7 Ultimate SP1, 64Bit, MUI (En, Ger, Es, Fr, It)",null,{"$f":"IF($P$9=7,\"X\",\"\")","v":""}]
[null,null,null,null,null,{"$f":"IF(AND($L$5=\"7\",OR($M$5=\"A\",$M$5=\"K\",$M$5=\"L\",$M$5=\"M\",)),1,0)","v":0},"W10 only with SSD / HDD / 128 GB CFast"," ",null,null,null,7,"|","|","|",null,"Windows 10 IoT Enterprise 2016 LTSB, 64Bit, MUI (Ger, En, Es, Fr, It)",null,{"$f":"IF($P$9=8,\"X\",\"\")","v":""}]
[null,null,null,null,null,{"$f":"IF(AND($L$5=\"8\",OR($M$5=\"A\",$M$5=\"K\",$M$5=\"L\",$M$5=\"M\",)),1,0)","v":0},"W10 only with SSD / HDD / 128 GB CFast"," ",null,null,null,8,"|","|","|",null,"Windows 10 IoT Enterprise 2019 LTSC, 64Bit, MUI (Ger, En, Es, Fr, It)",null,{"$f":"IF($P$9=9,\"X\",\"\")","v":""}]
[null,null,null,null,null,null,null,null,null,null,null,null,"|","|","|"]
[null,null,null,null,null,null,null,null,null,null,null,null,"|","|","|",null,"Drive"]
[null,null,null,{"$f":"IF(AND(($P$10=1),OR(($P$6<5),($P$7<7),($P$8>2),($P$12>3))),1,0)","v":0},"ET-variant only with: Celeron E3845 ET / 4 GB RAM ET / w/o mass storage or 60 GB SSD ET; w/o PCIe-variants; w/o ATEX/IECEx/cULus options"," ",null,null,null,null,null,null,"A","|","|",null,"without drive, with CFast-Slot",null,{"$f":"IF($P$10=1,\"X\",\"\")","v":""}]
[null,null,null,null,null,null,null,null,null,null,null,null,"C","|","|",null,"240 GB SSD",null,{"$f":"IF($P$10=2,\"X\",\"\")","v":""}]
[null,null,null,null,null,null,null,null,null,null,null,null,"D","|","|",null,"480 GB SSD",null,{"$f":"IF($P$10=3,\"X\",\"\")","v":"X"}]
[null,null,null,null,null," ",null,null,null,null,null,null,"E","|","|",null,"256 GB Eco SSD",null,{"$f":"IF($P$10=4,\"X\",\"\")","v":""}]
[null,null,null,{"$f":"IF(AND(($P$10=5),OR(($P$6<5),($P$7<7),($P$8>2),($P$12>3))),1,0)","v":0},"ET-variant only with: Celeron E3845 ET / 4 GB RAM ET / w/o mass storage or 60 GB SSD ET; w/o PCIe-variants; w/o ATEX/IECEx/cULus options"," ",null,null,null,null,null,null,"H","|","|",null,"60 GB SSD ET",null,{"$f":"IF($P$10=5,\"X\",\"\")","v":""}]
[null,null,null,null,null,null,null,null,null,null,null,null,"K","|","|",null,"4 GB CFast",null,{"$f":"IF($P$10=6,\"X\",\"\")","v":""}]
[null,null,null,null,null,null,null,null,null,null,null,null,"L","|","|",null,"8 GB CFast",null,{"$f":"IF($P$10=7,\"X\",\"\")","v":""}]
[null,null,null,null,null,null,null,null,null,null,null,null,"M","|","|",null,"16 GB CFast",null,{"$f":"IF($P$10=8,\"X\",\"\")","v":""}]
[null,null,null,null,null,null,null,null,null,null,null,null,"N","|","|",null,"128 GB CFast",null,{"$f":"IF($P$10=9,\"X\",\"\")","v":""}]
[null,null,null,null,null,null,null,null," ",null,null,null,"R","|","|",null,"320 GB HDD",null,{"$f":"IF($P$10=10,\"X\",\"\")","v":""}]
[null,null,null,null,null,null,null,null,null,null,null,null,null,"|","|"]
[null,null,null,null,null,null,null,null,null,null,null,null,null,"|","|",null,"Software configuration"]
[null,null,null,null,null,null,null,null,null,null,null,null,null,"A","|",null,"without SIMATIC Software",null,{"$f":"IF($P$11=1,\"X\",\"\")","v":"X"}]
[null," ",null,null,null,{"$f":"IF(AND($P$11=2,OR($P$9>1,$P$10=1,$P$10=6,$P$10=7,$P$10=8,$P$10=9,$P$10=10)),1,0)","v":0},"SIMATIC Industrial OS only w/o Windows Operating System and with SSD"," ",null,null,null,null,null,"N","|",null,"SIMATIC Industrial OS V2",null,{"$f":"IF($P$11=2,\"X\",\"\")","v":""}]
[null," ",null,null,null,{"$f":"IF(AND(($P$11=3),OR(($P$6<>4),($P$7=1),($P$7=2),($P$7=4),($P$7=5),($P$9>1),($P$10=1),($P$10>3),($P$12>3))),1,0)","v":0},"Industrial Edge SINUMERIK only with: N2930 with TPM / 8 GB RAM (w/o or with NVRAM) / w/o Operating System / 240 or 480 GB SSD / w/o ATEX"," ",null,null,null,null,null,"V","|",null,"Industrial Edge - SINUMERIK",null,{"$f":"IF($P$11=3,\"X\",\"\")","v":""}]
[null," ",null,null,null,{"$f":"IF(AND(($P$11=4),OR(($P$6<>4),($P$7<>3),($P$8<>1),($P$9>1),($P$10<>2),($P$12<>1))),1,0)","v":0},"Industrial Edge SIMATIC only with: N2930 with TPM / 8 GB RAM w/o NVRAM / Base w/o COM / w/o Operating System / 240 GB SSD / DIN-Rail w/o ATEX"," ",null,null,null,null,null,"W","|",null,"Industrial Edge - SIMATIC",null,{"$f":"IF($P$11=4,\"X\",\"\")","v":""}]
[null,null,null,null,null,null,null,null,null,null,null,null,null,null,"|"]
[null,null,null,null,null,null,null,null,null,null,null,null,null,null,"|",null,"Mounting"]
[null,null,null,null,null,null,null,null,null,null,null,null,null,null,1,null,"DIN-Rail",null,{"$f":"IF($P$12=1,\"X\",\"\")","v":"X"}]
[null,null,null,null,null,null,null,null,null,null,null,null,null,null,2,null,"Wall-mount",null,{"$f":"IF($P$12=2,\"X\",\"\")","v":""}]
[null,null,null,null,null,null,null,null,null,null,null,null,null,null,3,null,"Book-mount",null,{"$f":"IF($P$12=3,\"X\",\"\")","v":""}]
[null,null,null,null,null,null,null,null,null,null,null,null,null,null,4,null,"DIN-Rail with ATEX/IECEx Cat 3G Zone 2 / cULus Class I Div. 2",null,{"$f":"IF($P$12=4,\"X\",\"\")","v":""}]
[null,null,null,null,null,null,null,null,null,null,null,null,null,null,5,null,"Wall-mount with ATEX/IECEx Cat 3G Zone 2 / cULus Class I Div. 2",null,{"$f":"IF($P$12=5,\"X\",\"\")","v":""}]
[null,null,null,null,null,null,null,null,null,null,null,null,null,null,6,null,"Book-mount with ATEX/IECEx Cat 3G Zone 2 / cULus Class I Div. 2",null,{"$f":"IF($P$12=6,\"X\",\"\")","v":""}]
[]
[]
[null,null,null,null,null,null,null,null,null,null,null,null,null,null,null,null,"Base version",null,"X"]
[]
["6ES7",6,4,7," - ",{"$f":"F5","v":8},"B","A","1","1","-","0","D","A","1",null,null,"Total:"]
[]
[]
["Accessories:"]
[]
[]
["6ES7648-1AA50-0XL0",null,null,null,null,null,null,null,null,null,null,null,null,null,null,null,"Strain relief set cable/connector (5 pieces)"]
["6ES7648-1AA50-0XG0",null,null,null,null,null,null,null,null,null,null,null,null,null,null,null,"Dust protection set interfaces"]

{"sheet":"IPC227G (Nanobox)","index":13,"n_rows":68,"n_cols":19,"rows_kept":68,"cut":false,"hidden":false,"merged":[]}
["SIMATIC IPC227G  (Nanobox PC)"]
[]
[]
[null,null,null,null,null,null,null,null,null,null,null,null,null,null,null,null,{"$f":"IF(B45,C45,\"\")&IF(B46,C46,\"\")&IF(B47,C47,\"\")","v":""}]
["6ES7",6,4,7,"-",8,"C",{"$f":"IF(P6=1,H15,)&IF(P6=2,H16,)&IF(P6=3,H17,)&IF(P6=4,H18,)&IF(P6=5,H19,)&IF(P6=6,H20,)","v":"A"},{"$f":"IF(P7=1,I23,)&IF(P7=2,I24,)&IF(P7=3,I25,)","v":"1"},{"$f":"IF(P8=1,J28,)&IF(P8=2,J29,)&IF(P8=3,J30,)","v":"1"},"-",{"$f":"IF(P9=1,L33,)&IF(P9=2,L34,)&IF(P9=3,L35,)&IF(P9=4,L36,)","v":"1"},{"$f":"IF(P10=1,M39,)&IF(P10=2,M40,)&IF(P10=3,M41,)","v":"A"},{"$f":"IF(P11=1,N44,)&IF(P11=2,N45,)&IF(P11=3,N46,)&IF(P11=4,N47,)","v":"A"},{"$f":"IF(P12=1,O50,)&IF(P12=2,O51,)&IF(P12=3,O52,)&IF(P12=4,O53,)&IF(P12=5,O54,)&IF(P12=6,O55,)&IF(P12=7,O56,)","v":"0"},null,{"$f":"\"SIMATIC IPC227G  (Nanobox PC)\"","v":"SIMATIC IPC227G  (Nanobox PC)"},{"$f":"$A$5&$B$5&$C$5&$D$5&$E$5&$F$5&$G$5&$H$5&$I$5&$J$5&$K$5&$L$5&$M$5&$N$5&$O$5","v":"6ES7647-8CA11-1AA0"}]
[null,null,null,null,null,null,null,"|","|","|",null,"|","|","|","|",1,{"$f":"IF(P6=1,Q15,)&IF(P6=2,Q16,)&IF(P6=3,Q17,)&IF(P6=4,Q18,)&IF(P6=5,Q19,)&IF(P6=6,Q20,)","v":"Atom X6211E (2-Core)"}]
[null,null,null,null,null,null,null,"|","|","|",null,"|","|","|","|",1,{"$f":"IF(P7=1,Q23,)&IF(P7=2,Q24,)&IF(P7=3,Q25,)","v":"4 GB RAM"}]
[null,null,null,null,null,null,null,"|","|","|",null,"|","|","|","|",1,{"$f":"IF(P8=1,Q28,)&IF(P8=2,Q29,)&IF(P8=3,Q30,)","v":"without COM"},"Link utili"]
[null,null,null,null,null,null,{"$f":"IF(P9=12,#REF!,IF(P9=13,#REF!,IF(P9=15,#REF!,IF(P9=16,#REF!,IF(P9=17,#REF!,\"\")))))","v":""},"|","|","|",null,"|","|","|","|",1,{"$f":"IF(P9=1,Q33,)&IF(P9=2,Q34,)&IF(P9=3,Q35,)&IF(P9=4,Q36,)","v":"without drive"},"Certificati"]
[null,null,null,null,null,null,null,"|","|","|",null,"|","|","|","|",1,{"$f":"IF(P10=1,Q39,)&IF(P10=2,Q40,)&IF(P10=3,Q41,)","v":"without HW extension"},"Datasheet"]
[null,null,null,null,null,null,null,"|","|","|",null,"|","|","|","|",1,{"$f":"IF(P11=1,Q44,)&IF(P11=2,Q45,)&IF(P11=3,Q46,)&IF(P11=4,Q47,)","v":"without Software"},"Manuale"]
[null,null,null,null,null,null,null,"|","|","|",null,"|","|","|","|",1,{"$f":"IF(P12=1,Q50,)&IF(P12=2,Q51,)&IF(P12=3,Q52,)&IF(P12=4,Q53,)&IF(P12=5,Q54,)&IF(P12=6,Q55,)&IF(P12=7,Q56,)","v":"without mountig"},"CAD 2D/3D"]
[null,null,null,null,null,null,null,"|","|","|",null,"|","|","|","|"]
[null," ",null,null,null,null,null,"|","|","|",null,"|","|","|","|",null,"Processor / TPM"]
[null,null,null,null,null,null,null,"A","|","|",null,"|","|","|","|",null,"Atom X6211E (2-Core)",null,{"$f":"IF($P$6=1,\"X\",\"\")","v":"X"}]
[null,null,null,null,null,null,null,"B","|","|",null,"|","|","|","|",null,"Atom X6413E (4-Core)",null,{"$f":"IF($P$6=2,\"X\",\"\")","v":""}]
[null,null,null,null,null,null,null,"C","|","|",null,"|","|","|","|",null,"Atom X6414RE (4-Core)",null,{"$f":"IF($P$6=3,\"X\",\"\")","v":""}]
[null,null,null,null,null,null,null,"D","|","|",null,"|","|","|","|",null,"Atom X6211E (2-Core) / TPM",null,{"$f":"IF($P$6=4,\"X\",\"\")","v":""}]
[null,null,null,null,null,null,null,"E","|","|",null,"|","|","|","|",null,"Atom X6413E (4-Core) / TPM",null,{"$f":"IF($P$6=5,\"X\",\"\")","v":""}]
[null,null,null,null,null,null,null,"F","|","|",null,"|","|","|","|",null,"Atom X6414RE (4-Core) / TPM",null,{"$f":"IF($P$6=6,\"X\",\"\")","v":""}]
[null,null,null,null,null,null,null,null,"|","|",null,"|","|","|","|"]
[null,null,null,null,null,null,null,null,"|","|",null,"|","|","|","|",null,"RAM"]
[null,null,null,null,null,null,null,null,1,"|",null,"|","|","|","|",null,"4 GB RAM",null,{"$f":"IF($P$7=1,\"X\",\"\")","v":"X"}]
[null,null,null,null,null,null,null,null,2,"|",null,"|","|","|","|",null,"8 GB RAM",null,{"$f":"IF($P$7=2,\"X\",\"\")","v":""}]
[null,null,null,null,null,null,null,null,3,"|",null,"|","|","|","|",null,"16 GB RAM",null,{"$f":"IF($P$7=3,\"X\",\"\")","v":""}]
[null,null,null,null,null,null,null,null,null,"|",null,"|","|","|","|"]
[null,null,null,null,null,null,null,null,null,"|",null,"|","|","|","|",null,"Hardware configuration"]
[null,null,null,null,null,null,null,null,null,1,null,"|","|","|","|",null,"without COM",null,{"$f":"IF($P$8=1,\"X\",\"\")","v":"X"}]
[null,null,null,null,null,null,null,null,null,2,null,"|","|","|","|",null,"1x COM",null,{"$f":"IF($P$8=2,\"X\",\"\")","v":""}]
[null,null,null,null,null,null,null,null,null,3,null,"|","|","|","|",null,"2x COM",null,{"$f":"IF($P$8=3,\"X\",\"\")","v":""}]
[null,null,null,null,null,null,null,null,null,null,null,"|","|","|","|"]
[null,null,null,null,null,null,null,null,null,null,null,"|","|","|","|",null,"Drive"]
[null,null,null,null,null,null,null,null,null,null,null,1,"|","|","|",null,"without drive",null,{"$f":"IF($P$9=1,\"X\",\"\")","v":"X"}]
[null,null,null,null,null,null,null," ",null,null,null,2,"|","|","|",null,"256 GB Eco SSD",null,{"$f":"IF($P$9=2,\"X\",\"\")","v":""}]
[null,null,null,null,null,null,null," ",null,null,null,3,"|","|","|",null,"240 GB SSD",null,{"$f":"IF($P$9=3,\"X\",\"\")","v":""}]
[null,null,null,null,null,null,null," ",null,null,null,4,"|","|","|",null,"480 GB SSD",null,{"$f":"IF($P$9=4,\"X\",\"\")","v":""}]
[null,null,null,null,null,null,null,null,null,null,null,null,"|","|","|"]
[null,null,null,null,null,null,null,null,null,null,null,null,"|","|","|",null,"Hardware extension"]
[null,null,null,null,null,null,null,null,null,null,null,null,"A","|","|",null,"without HW extension",null,{"$f":"IF($P$10=1,\"X\",\"\")","v":"X"}]
[null,null,null,null,null,null,null,null,null,null,null,null,"B","|","|",null,"NVRAM",null,{"$f":"IF($P$10=2,\"X\",\"\")","v":""}]
[null,null,null,null,null,null,null,null,null,null,null,null,"C","|","|",null,"AI Accelerator",null,{"$f":"IF($P$10=3,\"X\",\"\")","v":""}]
[null,null,null,null,null,null,null,null,null,null,null,null,null,"|","|"]
[null,null,null,null,null,null,null,null,null,null,null,null,null,"|","|",null,"Software configuration"]
[null,null,null,null,null,null,null,null,null,null,null,null,null,"A","|",null,"without Software",null,{"$f":"IF($P$11=1,\"X\",\"\")","v":"X"}]
[null,{"$f":"IF(AND(($P$11=2),($P$9=1)),1,0)","v":0},"Windows10 only with drive"," ",null,null,null," ",null,null,null,null,null,"B","|",null,"Windows 10 IoT Enterprise 2019 LTSC, 64Bit, MUI (Ger, En, Es, Fr, It)",null,{"$f":"IF($P$11=2,\"X\",\"\")","v":""}]
[null,{"$f":"IF(AND(($P$11=3),($P$9=1)),1,0)","v":0},"Windows10 only with drive"," ",null,null,null," ",null,null,null,null,null,"C","|",null,"Windows 10 IoT Enterprise 2021 LTSC, 64Bit, MUI (Ger, En, Es, Fr, It)",null,{"$f":"IF($P$11=3,\"X\",\"\")","v":""}]
[null,{"$f":"IF(AND(($P$11=4),OR(($P$6<>5),($P$7=1),($P$7=4),($P$7=5),($P$7=6),($P$9=1),($P$9=2),($P$10=2),($P$10=3))),1,0)","v":0},"Industrial Edge only with: X6413E with TPM, 8/16G RAM, 240/480 GB SSD, w/o HW extension"," ",null,null,null," ",null,null,null,null,null,"W","|",null,"Industrial Edge - SIMATIC",null,{"$f":"IF($P$11=4,\"X\",\"\")","v":""}]
[null,null,null,null,null,null,null,null,null,null,null,null,null,null,"|"]
[null,null,null,null,null,null,null,null,null,null,null,null,null,null,"|",null,"Mounting"]
[null,null,null,null,null,null,null,null,null,null,null,null,null,null,0,null,"without mountig",null,{"$f":"IF($P$12=1,\"X\",\"\")","v":"X"}]
[null,null,null,null,null,null,null,null,null,null,null,null,null,null,1,null,"DIN-Rail",null,{"$f":"IF($P$12=2,\"X\",\"\")","v":""}]
[null,null,null,null,null,null,null,null,null,null,null,null,null,null,2,null,"Wall-mount",null,{"$f":"IF($P$12=3,\"X\",\"\")","v":""}]
[null,null,null,null,null,null,null,null,null,null,null,null,null,null,3,null,"Book-mount",null,{"$f":"IF($P$12=4,\"X\",\"\")","v":""}]
[null,null,null,null,null,null,null,null,null,null,null,null,null,null,4,null,"DIN-Rail with ATEX/IECEx Cat 3G Zone 2 / cULus Class I Div. 2",null,{"$f":"IF($P$12=5,\"X\",\"\")","v":""}]
[null,null,null,null,null,null,null,null,null,null,null,null,null,null,5,null,"Wall-mount with ATEX/IECEx Cat 3G Zone 2 / cULus Class I Div. 2",null,{"$f":"IF($P$12=6,\"X\",\"\")","v":""}]
[null,null,null,null,null,null,null,null,null,null,null,null,null,null,6,null,"Book-mount with ATEX/IECEx Cat 3G Zone 2 / cULus Class I Div. 2",null,{"$f":"IF($P$12=7,\"X\",\"\")","v":""}]
[]
[]
[null,null,null,null,null,null,null,null,null,null,null,null,null,null,null,null,"Base version",null,"X"]
[]
["6ES7",6,4,7," - ",{"$f":"F5","v":8},"C","A","1","1","-","1","A","A","0",null,null,"Total:"]
[]
[]
["Accessories:"]
[]
[]
[]
[null,null,null,null,null,null,null,null,null,null,null,null,null,null,null,null,"Click here\nfor additional SIMATIC IPC accessories."]

{"sheet":"IPC327G (Basicbox)","index":14,"n_rows":49,"n_cols":19,"rows_kept":49,"cut":false,"hidden":false,"merged":[[1,19,3,19]]}
["SIMATIC IPC327G  ",null,null,null,null,null,null,null,null,null,null,null,null,null,null,null,{"$f":"IF(OR(($G$5=\"#\"),($H$5=\"#\"),($I$5=\"#\"),($J$5=\"#\"),($L$5=\"#\"),($M$5=\"#\")),\"Invalid configuration\",\"\")","v":""}]
[]
[]
[]
["6AG4",0,2,2,"-",0,"B",{"$f":"IF(P6=1,H17,)&IF(P6=2,H18,)&IF(P6=3,H19,)&IF(P6=4,H20,)&IF(P6=5,#REF!,)&IF(P6=6,#REF!,)&IF(P6=7,#REF!,)","v":"A"},{"$f":"IF(P7=1,I23,)&IF(P7=2,I24,)&IF(P7=3,I25,)&IF(P7=4,#REF!,)&IF(P7=5,#REF!,)&IF(P7=6,#REF!,)&IF(P7=7,#REF!,)","v":"2"},{"$f":"IF(P8=1,J28,)&IF(P8=2,J29,)&IF(P8=3,#REF!,)&IF(P8=4,#REF!,)","v":"1"},"-",{"$f":"IF(P9=1,L32,)&IF(P9=2,L33,)&IF(P9=3,#REF!,)&IF(P9=4,#REF!,)","v":"0"},{"$f":"IF(P10=1,M36,)&IF(P10=2,M37,)&IF(P10=3,M38,)&IF(P10=4,#REF!,)","v":"A"},{"$f":"IF(P11=1,N41,)&IF(P11=2,#REF!,)&IF(P11=3,#REF!,)&IF(P11=4,#REF!,)&IF(P11=5,#REF!,)","v":"A"},{"$f":"IF(P12=1,O44,)&IF(P12=2,O45,)&IF(P12=3,#REF!,)&IF(P12=4,#REF!,)&IF(P12=5,#REF!,)&IF(P12=6,#REF!,)","v":"1"},null,{"$f":"\"SIMATIC IPC327G\"","v":"SIMATIC IPC327G"},{"$f":"$A$5&$B$5&$C$5&$D$5&$E$5&$F$5&$G$5&$H$5&$I$5&$J$5&$K$5&$L$5&$M$5&$N$5&$O$5","v":"6AG4022-0BA21-0AA1"}]
[null,null,null,null,null,null,null,"|","|","|",null,"|","|","|","|",1,{"$f":"IF(P6=1,Q17,)&IF(P6=2,Q18,)&IF(P6=3,Q19,)&IF(P6=4,Q20,)","v":"Intel Atomx6413E Processor (up to 3.0 GHz)"}]
[null,null,null,null,null,null,null,"|","|","|",null,"|","|","|","|",1,{"$f":"IF(P7=1,Q23,)&IF(P7=2,Q24,)&IF(P7=3,Q25,)","v":"4GB RAM"}]
[null,null,null,null,null,null,null,"|","|","|",null,"|","|","|","|",1,{"$f":"IF(P8=1,Q28,)&IF(P8=2,Q29,)","v":"basic 4USB+2COM"},"Link utili"]
[null,null,null,null,null,null,{"$f":"IF(P9=12,#REF!,IF(P9=13,#REF!,IF(P9=15,#REF!,IF(P9=16,#REF!,IF(P9=17,#REF!,\"\")))))","v":""},"|","|","|",null,"|","|","|","|",1,{"$f":"IF(P9=1,Q32,)&IF(P9=2,Q33,)","v":"without Software"},"Certificati"]
[null,null,null,null,null,null,null,"|","|","|",null,"|","|","|","|",1,{"$f":"IF(P10=1,Q36,)&IF(P10=2,Q37,)&IF(P10=3,Q38,)","v":"without mass storage"},"Datasheet"]
[null,null,null,null,null,null,null,"|","|","|",null,"|","|","|","|",1,null,"Manuale"]
[null,null,null,null,null,null,null,"|","|","|",null,"|","|","|","|",1,{"$f":"IF(P12=1,Q44,)&IF(P12=2,Q45,)","v":"Wall-mounting"},"CAD 2D/3D"]
[null,null,null,null,null,null,null,"|","|","|",null,"|","|","|","|"]
[null,null,null,null,null,null,null,"|","|","|",null,"|","|","|","|"]
[null,null,null,null,null,null,null,"|","|","|",null,"|","|","|","|"]
[null," ",null,null,null,null,null,"|","|","|",null,"|","|","|","|",null,"CPU"]
[null,null,null,null,null,null,null,"A","|","|",null,"|","|","|","|",null,"Intel Atomx6413E Processor (up to 3.0 GHz)",null,{"$f":"IF($P$6=1,1,\"\")","v":1}]
[null,null,null,null,null,null,null,"B","|","|",null,"|","|","|","|",null,"Intel Atomx6413E Processor (up to 3.0 GHz)/TPM",null,{"$f":"IF($P$6=2,1,\"\")","v":""}]
[null,null,null,null,null,null,null,"C","|","|",null,"|","|","|","|",null,"Intel Atomx6413E Processor (up to 3.0 GHz)/w/o Audio",null,{"$f":"IF($P$6=3,1,\"\")","v":""}]
[null,null,null,null,null,null,null,"D","|","|",null,"|","|","|","|",null,"Intel Atomx6413E Processor (up to 3.0 GHz)/TPM/w/o Audio",null,{"$f":"IF($P$6=4,1,\"\")","v":""}]
[null,null,null,null,null,null,null,null,"|","|",null,"|","|","|","|"]
[null,null,null,null,null,null,null,null,"|","|",null,"|","|","|","|",null,"Memory"]
[null,null,null,null,null,null,null,null,2,"|",null,"|","|","|","|",null,"4GB RAM",null,{"$f":"IF($P$7=1,1,\"\")","v":1}]
[null,null,null,null,null,null,null,null,3,"|",null,"|","|","|","|",null,"8GB RAM",null,{"$f":"IF($P$7=2,1,\"\")","v":""}]
[null,null,null,null,null,null,null,null,4,"|",null,"|","|","|","|",null,"16GB RAM",null,{"$f":"IF($P$7=3,1,\"\")","v":""}]
[null,null,null,null,null,null,null,null,null,"|",null,"|","|","|","|"]
[null,null,null,null,null,null,null,null,null,"|",null,"|","|","|","|",null,"HW extension"]
[null,null,null,null,null,null,null,null,null,1,null,"|","|","|","|",null,"basic 4USB+2COM",null,{"$f":"IF($P$8=1,1,\"\")","v":1}]
[null,null,null,null,null,null,null,null,null,2,null,"|","|","|","|",null,"4USB+4COM via pinheader",null,{"$f":"IF($P$8=2,1,\"\")","v":""}]
[null,null,null,null,null,null,null,null,null,null,null,"|","|","|","|"]
[null,null,null,null,null,null,null,null,null,null,null,"|","|","|","|",null,"OS"]
[null,null,null,null,null,null,null,null,null,null,null,0,"|","|","|",null,"without Software",null,{"$f":"IF($P$9=1,1,\"\")","v":1}]
[null,{"$f":"IF(AND(P9=2,P10=1),1,0)","v":0},"Windows10 only with drive",null,null,null,null," ",null,null,null,{"$f":"IF(OR($P$10=1),\"#\",\"2\")","v":"#"},"|","|","|",null,"Windows 10 Enterprise LTSC 2019, 64Bit, MUI (De, En, Fr, It, Sp)",null,{"$f":"IF($P$9=2,1,\"\")","v":""}]
[null,null,null,null,null,null,null,null,null,null,null,null,"|","|","|"]
[null,null,null,null,null,null,null,null,null,null,null,null,"|","|","|",null,"Mass storage"]
[null,null,null,null,null,null,null,null,null,null,null,null,"A","|","|",null,"without mass storage",null,{"$f":"IF($P$10=1,1,\"\")","v":1}]
[null,null,null,null,null,null,null,null,null,null,null,null,"B","|","|",null,"256G  Eco SSD",null,{"$f":"IF($P$10=2,1,\"\")","v":""}]
[null,null,null,null,null,null,null,null,null,null,null,null,"C","|","|",null,"512G  Eco SSD",null,{"$f":"IF($P$10=3,1,\"\")","v":""}]
[null,null,null,null,null,null,null,null,null,null,null,null,null,"|","|"]
[null,null,null,null,null,null,null,null,null,null,null,null,null,"|","|",null,"Reserve"]
[null,null,null,null,null,null,null,null,null,null,null,null,null,"A","|",null,null,null,{"$f":"IF($P$11=1,1,\"\")","v":1}]
[null,null,null,null,null,null,null,null,null,null,null,null,null,null,"|"]
[null,null,null,null,null,null,null,null,null,null,null,null,null,null,"|",null,"Mouting"]
[null,null,null,null,null,null,null,null,null,null,null,null,null,null,1,null,"Wall-mounting",null,{"$f":"IF($P$12=1,1,\"\")","v":1}]
[null,null,null,null,null,null,null,null,null,null,null,null,null,null,2,null,"Din-rail",null,{"$f":"IF($P$12=2,1,\"\")","v":""}]
[]
[]
[null,null,null,null,null,null,null,null,null,null,null,null,null,null,null,null,"Base version",null,1]
[null,null,null,null,null,null,null,null,null,null,null,null,null,null,null,null,null,"Total"]

{"sheet":"IPC427E (Microbox)","index":15,"n_rows":112,"n_cols":21,"rows_kept":112,"cut":false,"hidden":false,"merged":[]}
["SIMATIC IPC427E (Box PC)",null,null,null,null,null,null,null,null,null,null,null,null,null,null,null,"Prodotto Superato da  IPC BX-39A - IPC BX-32A ",null,null,null,"."]
[null,null,null,null,null,null,null,null,null,null,null,null,null,null,null,null,{"$f":"$A$5&$B$5&$C$5&$D$5&$E$5&$F$5&$G$5&$H$5&$I$5&$J$5&$K$5&$L$5&$M$5&$N$5&$O$5","v":"6AG4141-0AA00-0AA0"}]
[null,null,{"$f":"IF(OR(F5=\"#\",G5=\"#\",H5=\"#\",I5=\"#\",J5=\"#\",L5=\"#\",M5=\"#\",N5=\"#\",P5=\"#\",O5=\"#\"),1,0)","v":0},"Configuration not possible. Mind the combinations of the options",null,null,null,null,null,null,null,null,null,null,null," ",{"$f":"IF(C3,D3,\"\")","v":""}]
[]
["6AG4",1,4,1,"-",{"$f":"VLOOKUP(P6,A18:Q22,6,TRUE)","v":0},{"$f":"VLOOKUP(P7,A25:Q31,7,TRUE)","v":"A"},{"$f":"VLOOKUP(P8,A34:Q43,8,TRUE)","v":"A"},{"$f":"VLOOKUP(P9,A46:Q52,9,TRUE)","v":0},{"$f":"VLOOKUP(P10,A55:Q63,10,TRUE)","v":0},"-",{"$f":"VLOOKUP(P11,A66:Q71,12,FALSE)","v":0},{"$f":"VLOOKUP(P12,A74:Q78,13,TRUE)","v":"A"},{"$f":"VLOOKUP(P13,A81:Q85,14,TRUE)","v":"A"},{"$f":"VLOOKUP(P14,A88:Q89,15,TRUE)","v":0},null,"SIMATIC IPC427E (Box PC)",{"$f":"A5&B5&C5&D5&E5&F5&G5&H5&I5&J5&K5&L5&M5&N5&O5","v":"6AG4141-0AA00-0AA0"}]
[null,null,null,null,null,"|","|","|","|","|",null,"|","|","|","|",1,{"$f":"VLOOKUP(P6,A18:Q22,17,FALSE)","v":"Celeron G3902E; 2x Gigabit Ethernet (IE/PN)"}]
[null,null,null,null,null,"|","|","|","|","|",null,"|","|","|","|",1,{"$f":"VLOOKUP(P7,A25:Q31,17,FALSE)","v":"without mounting material"}]
[null,null,null,null,null,"|","|","|","|","|",null,"|","|","|","|",1,{"$f":"VLOOKUP(P8,A34:Q43,17,FALSE)","v":"4GB"}]
[null,null,null,null,null,"|","|","|","|","|",null,"|","|","|","|",1,{"$f":"VLOOKUP(P9,A46:Q52,17,FALSE)","v":"no RS232/485, without PCIe"}]
[null,null,null,null,null,"|","|","|","|","|",null,"|","|","|","|",1,{"$f":"VLOOKUP(P10,A55:Q63,17,FALSE)","v":"without Windows Operating system"},"Link utili"]
[null,null,null,null,null,"|","|","|","|","|",null,"|","|","|","|",1,{"$f":"VLOOKUP(P11,A66:Q71,17,FALSE)","v":"without external mass storage"},"Certificati"]
[null,null,null,null,null,"|","|","|","|","|",null,"|","|","|","|",1,{"$f":"VLOOKUP(P12,A74:Q78,17,FALSE)","v":"without internal mass storage"},"Datasheet"]
[null,null,null,null,null,"|","|","|","|","|",null,"|","|","|","|",1,{"$f":"VLOOKUP(P13,A81:Q85,17,FALSE)","v":"without SIMATIC Software"},"Manuale"]
[null,null,null,null,null,"|","|","|","|","|",null,"|","|","|","|",1,{"$f":"VLOOKUP(P14,A88:Q89,17,FALSE)","v":"24V DC industrial power supply"},"CAD 2D/3D"]
[null,null,null,null,null,"|","|","|","|","|",null,"|","|","|","|",null," "]
[null,null,null,null,null,"|","|","|","|","|",null,"|","|","|","|"]
[null,null,null,null,null,"|","|","|","|","|",null,"|","|","|","|",null,"Processor and Fieldbus"]
[1,null,null,null,null,0,"|","|","|","|",null,"|","|","|","|",null,"Celeron G3902E; 2x Gigabit Ethernet (IE/PN)",null,{"$f":"IF($P$6=1,1,\"\")","v":1}]
[2,null,null,null,null,1,"|","|","|","|",null,"|","|","|","|",null,"Celeron G3902E; 3x Gigabit Ethernet (IE/PN)",null,{"$f":"IF($P$6=2,1,\"\")","v":""}]
[3,null,null,null,null,3,"|","|","|","|",null,"|","|","|","|",null,"Core i3-6102E; 3x Gigabit Ethernet (IE/PN)",null,{"$f":"IF($P$6=3,1,\"\")","v":""}]
[4,null,null,null,null,5,"|","|","|","|",null,"|","|","|","|",null,"Core i5-6442EQ; 3x Gigabit Ethernet (IE/PN);",null,{"$f":"IF($P$6=4,1,\"\")","v":""}]
[5,null,null,null,null,7,"|","|","|","|",null,"|","|","|","|",null,"XEON E3-1505L; 3x Gigabit Ethernet (IE/PN)",null,{"$f":"IF($P$6=5,1,\"\")","v":""}]
[null,null,null,null,null,null,"|","|","|","|",null,"|","|","|","|"]
[null,null,null,null,null,null,"|","|","|","|",null,"|","|","|","|",null,"Mounting"]
[1,null,null,null,null,null,"A","|","|","|",null,"|","|","|","|",null,"without mounting material",null,{"$f":"IF($P$7=1,1,\"\")","v":1}]
[2,null,null,null,null,null,"B","|","|","|",null,"|","|","|","|",null,"DIN-Rail",null,{"$f":"IF($P$7=2,1,\"\")","v":""}]
[3,null,null,null,null,null,"C","|","|","|",null,"|","|","|","|",null,"Wall-mount",null,{"$f":"IF($P$7=3,1,\"\")","v":""}]
[4,null,null,null,null,null,"D","|","|","|",null,"|","|","|","|",null,"Book-mount",null,{"$f":"IF($P$7=4,1,\"\")","v":""}]
[5,null,null,null,null,null,"F","|","|","|",null,"|","|","|","|",null,"DIN-Rail with ATEX/IECEx/UL HazLoc",null,{"$f":"IF($P$7=5,1,\"\")","v":""}]
[6,null,null,null,null,null,"G","|","|","|",null,"|","|","|","|",null,"Wall-mount with ATEX/IECEx/UL HazLoc",null,{"$f":"IF($P$7=6,1,\"\")","v":""}]
[7,null,null,null,null,null,"H","|","|","|",null,"|","|","|","|",null,"Book-mount with ATEX/IECEx/UL HazLoc",null,{"$f":"IF($P$7=7,1,\"\")","v":""}]
[null,null,null,null,null,null,null,"|","|","|",null,"|","|","|","|"]
[null,null,null,null,null,null," ","|","|","|",null,"|","|","|","|",null,"Ram/NVRAM/ECC"]
[1,null,null,null,null,null,null,"A","|","|",null,"|","|","|","|",null,"4GB",null,{"$f":"IF($P$8=1,1,\"\")","v":1}]
[2,null,null,null,null,null,null,"B","|","|",null,"|","|","|","|",null,"8GB",null,{"$f":"IF($P$8=2,1,\"\")","v":""}]
[3,null,null,null,null,null,null,"C","|","|",null,"|","|","|","|",null,"16GB",null,{"$f":"IF($P$8=3,1,\"\")","v":""}]
[4,null,null,null,null,null,null,{"$f":"IF($P$6<>4,\"D\",\"#\")","v":"D"},"|","|",null,"|","|","|","|",null,"8GB with ECC ",null,{"$f":"IF($P$8=4,1,\"\")","v":""}]
[5,null,{"$f":"IF(AND($P$6<>7,P7=5),1,0)","v":0},"Arbeitsspeicher mit ECC nur in Verbindung mit Core i7 mit IE/PN (Option \"6\")",".",null,null,{"$f":"IF($P$6<>4,\"E\",\"#\")","v":"E"},"|","|",null,"|","|","|","|",null,"16GB with ECC",null,{"$f":"IF($P$8=5,1,\"\")","v":""}]
[6,null,{"$f":"IF(AND($P$6<>7,P8=5),1,0)","v":0},"Arbeitsspeicher mit ECC nur in Verbindung mit Core i7 mit IE/PN (Option \"6\")",".",null,null,"F","|","|",null,"|","|","|","|",null,"4GB and NVRAM",null,{"$f":"IF($P$8=6,1,\"\")","v":""}]
[7,null,{"$f":"IF(AND($P$6<>7,P9=5),1,0)","v":0},"Arbeitsspeicher mit ECC nur in Verbindung mit Core i7 mit IE/PN (Option \"6\")",".",null,null,"G","|","|",null,"|","|","|","|",null,"8GB and NVRAM",null,{"$f":"IF($P$8=7,1,\"\")","v":""}]
[8,null,{"$f":"IF(AND($P$6<>7,P10=5),1,0)","v":0},"Arbeitsspeicher mit ECC nur in Verbindung mit Core i7 mit IE/PN (Option \"6\")",".",null,null,"H","|","|",null,"|","|","|","|",null,"16GB and NVRAM",null,{"$f":"IF($P$8=8,1,\"\")","v":""}]
[9,null,{"$f":"IF(AND($P$6<>7,P12=5),1,0)","v":0},"Arbeitsspeicher mit ECC nur in Verbindung mit Core i7 mit IE/PN (Option \"6\")",".",null,null,{"$f":"IF($P$6<>4,\"J\",\"#\")","v":"J"},"|","|",null,"|","|","|","|",null,"8GB with ECC and NVRAM",null,{"$f":"IF($P$8=9,1,\"\")","v":""}]
[10,null,{"$f":"IF(AND($P$6<>7,P13=5),1,0)","v":0},"Arbeitsspeicher mit ECC nur in Verbindung mit Core i7 mit IE/PN (Option \"6\")",".",null,null,{"$f":"IF($P$6<>4,\"K\",\"#\")","v":"K"},"|","|",null,"|","|","|","|",null,"16GB with ECC and NVRAM",null,{"$f":"IF($P$8=10,1,\"\")","v":""}]
[null,null,null,null,null,null,null," ","|","|",null,"|","|","|","|"]
[null,null,null,null,null,null,null,null,"|","|",null,"|","|","|","|",null,"Extension (HW)"]
[1,null,null,null,null,null,null,null,0,"|",null,"|","|","|","|",null,"no RS232/485, without PCIe",null,{"$f":"IF($P$9=1,1,\"\")","v":1}]
[2,null,null,null,null,null,null,null,1,"|",null,"|","|","|","|",null,"no RS232/485 and one PCIe",null,{"$f":"IF($P$9=2,1,\"\")","v":""}]
[3,null,null,null,null,null,null,null,2,"|",null,"|","|","|","|",null,"no RS232/485 and two PCIe",null,{"$f":"IF($P$9=3,1,\"\")","v":""}]
[4,null,null,null,null,null,null,null,3,"|",null,"|","|","|","|",null,"two RS232/485 and without PCIe",null,{"$f":"IF($P$9=4,1,\"\")","v":""}]
[5,null,null,null,null,null,null,null,4,"|",null,"|","|","|","|",null,"two RS232/485 and one PCIe",null,{"$f":"IF($P$9=5,1,\"\")","v":""}]
[6,null,null,null,null,null,null,null,5,"|",null,"|","|","|","|",null,"two RS232/485 and two PCIe",null,{"$f":"IF($P$9=6,1,\"\")","v":""}]
[7,null,null,null,null,null,null,null,{"$f":"IF(OR(($P$7>4),($P$10=2),($P$10=3),($P$10=4),($P$10=5),($P$10=8),($P$10=9),),\"#\",\"6\")","v":"6"},"|",null,"|","|","|","|",7,"two RS232/RS485 and two PCIe (x4 and x1), PCIe x4 with AI Accelerator",null,{"$f":"IF($P$9=7,1,\"\")","v":""}]
[null,null,null,null,null,null,null,null,null,"|",null,"|","|","|","|"]
[null,null,null,null,null,null,null,null,null,"|",null,"|","|","|","|",null,"Operating system"]
[1,null,{"$f":"IF(P10<>2,1,0)","v":1},null,null,null,null,null,null,0,null,"|","|","|","|",null,"without Windows Operating system",null,{"$f":"IF($P$10=1,1,\"\")","v":1}]
[2,null,{"$f":"IF(OR($P$12<3)*OR($P$11<3,$P$11>5),1,0)","v":1},"Multitouch only with Windows7 or WES7P",null,null,null,null,null,1,null,"|","|","|","|",null,"Windows Embedded Standard 7 E SP1, englisch, 32Bit",null,{"$f":"IF($P$10=2,1,\"\")","v":""}]
[3,null,{"$f":"IF(OR($P$12<3)*OR($P$11<3,$P$11>5),1,0)","v":1},"Windows 7 (32bit, 64bit) only with SSD oder HDD",".",null,null,null,null,2,null,"|","|","|","|",null,"Windows Embedded Standard 7 E SP1, englisch, 64Bit",null,{"$f":"IF($P$10=3,1,\"\")","v":""}]
[4,null,{"$f":"IF(AND($P$12<6,$P$10=3),1,0)","v":0},"Windows Embedded Standard only with Cfast from 8GB (WES7-E, 32bit) / from 16 GB (WES7-E, 64bit and WES7-P, 32bit) or SSD or HDD",".",null,null,null,null,3,null,"|","|","|","|",null,"Windows Embedded Standard 7 P SP1, MUI, 64Bit, Multitouch",null,{"$f":"IF($P$10=4,1,\"\")","v":""}]
[5,null,{"$f":"IF(AND($P$12<6,$P$10=3),1,0)","v":0},"Windows 7 (32bit, 64bit) only with SSD oder HDD",".",null,null,null,null,4,null,"|","|","|","|",null,"Windows7 Ultimate SP1, 64Bit, MUI (de, en, es, fr, it)",null,{"$f":"IF($P$10=5,1,\"\")","v":""}]
[6,null,null,null,null,null,null,null,null,{"$f":"IF($P$6<>5,\"5\",\"#\")","v":"5"},null,"|","|","|","|",null,"Windows 10 IoT Enterprise 2019 LTSC (64Bit) for Processors Celeron, i3 and i5",null,{"$f":"IF($P$10=6,1,\"\")","v":""}]
[7,null,null,null,null,null,null,null,null,{"$f":"IF($P$6=5,\"6\",\"#\")","v":"#"},null,"|","|","|","|",null,"Windows 10 IoT Enterprise 2019 LTSC (64Bit) for Processor Xeon",null,{"$f":"IF($P$10=7,1,\"\")","v":""}]
[8,null,{"$f":"IF(AND($P$12<6,$P$10=3),1,0)","v":0},"SIMATIC RT-Advanced and WinAC-Bundles only with WES7-E, 32 Bit and RAM from 4GB, CFast from 8GB or SSD",".",null,null,null,null,{"$f":"IF($P$6<>5,\"7\",\"#\")","v":"7"},null,"|","|","|","|",null,"Windows 10 Enterprise 2016 LTSB (64Bit) for Processors Celeron, i3 and i5",null,{"$f":"IF($P$10=8,1,\"\")","v":""}]
[9,null,{"$f":"IF(AND($P$12<6,$P$10=3),1,0)","v":0},"SIMATIC RT-Advanced and WinAC-Bundles only with WES7-E, 32 Bit and RAM from 4GB, CFast from 8GB or SSD",".",null,null,null,null,{"$f":"IF($P$6=5,\"8\",\"#\")","v":"#"},null,"|","|","|","|",null,"Windows 10 Enterprise 2016 LTSB (64Bit) for Processor Xeon",null,{"$f":"IF($P$10=9,1,\"\")","v":""}]
[null,null,null,null,null,null,null,null,null,null,null,"|","|","|","|",null," "]
[null,null,null,null,null,null,null,null,null,null,null,"|","|","|","|",null,"Drive changeable (accessible)"]
[1,null,null,null,null,null,null,null,null,null,null,0,"|","|","|",null,"without external mass storage",null,{"$f":"IF($P$11=1,1,\"\")","v":1}]
[2,null,null,null,null,null,null,null,null,null,null,1,"|","|","|",null,"CFAST 2GB, without Operating system",null,{"$f":"IF($P$11=2,1,\"\")","v":""}]
[3,null,null,null,null,null,null,null,null,null,null,2,"|","|","|",null,"CFAST 4GB, without Operating system",null,{"$f":"IF($P$11=3,1,\"\")","v":""}]
[4,null,null,null,null,null,null,null,null,null,null,3,"|","|","|",null,"CFAST 8GB (only optional with operating system/SW, if no internal mass storage)",null,{"$f":"IF($P$11=4,1,\"\")","v":""}]
[5,null,null,null,null,null,null,null,null,null,null,4,"|","|","|",null,"CFAST 16GB (only optional with operating system/SW, if no internal mass storage)",null,{"$f":"IF($P$11=5,1,\"\")","v":""}]
[6,null,null,null,null,null,null,null,null,null,null,5,"|","|","|",null,"CFAST 128GB (only optional with operating system/SW, if no internal mass storage)",null,{"$f":"IF($P$11=6,1,\"\")","v":""}]
[null,null,null,null,null,null,null,null,null,null,null,null,"|","|","|"]
[null,null,null,null,null,null," ",null,null,null,null,null,"|","|","|",null,"Drive internal (not accessible)"]
[1,null,null,null,null,null,null,null,null,null,null,null,{"$f":"IF(OR(AND($P$10=2,$P$11>3),AND($P$10=3,$P$11>4),AND($P$10=4,$P$11>4),AND($P$10>5,$P$11=6),$P$10=1),\"A\",\"#\")","v":"A"},"|","|",null,"without internal mass storage",null,{"$f":"IF($P$12=1,1,\"\")","v":1}]
[2,null,null,null,null,null,null,null,null,null,null,null,"D","|","|",null,"256 GB Eco SSD",null,{"$f":"IF($P$12=2,1,\"\")","v":""}]
[3,null,null,null,null,null,null,null,null,null,null,null,"F","|","|",null,"240 GB SSD",null,{"$f":"IF($P$12=3,1,\"\")","v":""}]
[4,null,null,null,null,null,null,null,null,null,null,null,"G","|","|",null,"480 GB SSD",null,{"$f":"IF($P$12=4,1,\"\")","v":""}]
[5,null," ",null,null,null,null,null,null,null,null,null,{"$f":"IF($P$7<5,\"J\",\"#\")","v":"J"},"|","|",null,"HDD 320GB",null,{"$f":"IF($P$12=5,1,\"\")","v":""}]
[null,null,null,null,null,null,null,null,null,null,null,null,null,"|","|"]
[null,null,null,null,null,null," "," "," "," ",null," "," ","|","|",null,"Software Configuration preinstalled (Bundles)"]
[1,null,null,null,null,null," "," "," "," "," "," "," ","A","|",null,"without SIMATIC Software",null,{"$f":"IF($P$13=1,1,\"\")","v":1}]
[2,null,null,null,null,null,null,null,null,null,null,null,null,{"$f":"IF(OR($P$10>1,$P$11>1,$P$12=1),\"#\",\"N\")","v":"#"},"|",null,"SIMATIC Industrial OS V2",null,{"$f":"IF($P$13=2,1,\"\")","v":""}]
[3,null,null,null,null,null,null,null,null,null,null,null,null,{"$f":"IF(AND(($P$6=4),(OR(($P$7=2),($P$7=4))),($P$8=3),($P$9=4),($P$10=1),($P$11=1),($P$12=4),($P$14=2)),\"V\",\"#\")","v":"#"},"|",null,"Industrial Edge - SINUMERIK",null,{"$f":"IF($P$13=3,1,\"\")","v":""}]
[4,null,null,null,null,null,null,null,null,null,null,null,null,{"$f":"IF(OR(AND(($P$6=2),($P$7=4),($P$8=1),($P$9=2),($P$10=8),($P$11=1),($P$12=3),($P$13=4),($P$14=1)),AND(($P$6=4),($P$7=4),($P$8=2),($P$9=2),($P$10=8),($P$11=1),($P$12=3),($P$13=4),($P$14=1)),AND(($P$6=2),($P$7=4),($P$8=1),($P$9=2),($P$10=6),($P$11=1),($P$12=3),($P$13=4),($P$14=1)),AND(($P$6=4),($P$7=4),($P$8=2),($P$9=2),($P$10=6),($P$11=1),($P$12=3),($P$13=4),($P$14=1))),\"X\",\"#\")","v":"#"},"|",null,"SINUMERIK PCU Basesoftware on IPC",null,{"$f":"IF($P$13=4,1,\"\")","v":""}]
[5,null,null,null,null,null,null,null,null,null,null,null,null,{"$f":"IF(OR(AND(($P$6=4),($P$7=2),($P$8=3),($P$9=4),($P$10=1),($P$11=1),($P$12=3),($P$13=5),($P$14=2)),AND(($P$6=5),($P$7=2),($P$8=3),($P$9=3),($P$10=1),($P$11=1),($P$12=4),($P$14=2))),\"W\",\"#\")","v":"#"},"|",null,"Industrial Edge - SIMATIC",null,{"$f":"IF($P$13=5,1,\"\")","v":""}]
[null,null,null,null,null,null,null,null,null,null,null,null,null,null,"|"]
[null,null,null,null,null,null," "," "," "," "," "," "," ",null,"|",null,"Power supply"]
[1,null,null,null,null,null,null,null,null,null,null,null,null,null,0,null,"24V DC industrial power supply",null,{"$f":"IF($P$14=1,1,\"\")","v":1}]
[2,null,{"$f":"IF($P$14=2,1,0)","v":0},"IPCs with TPM (Trusted Platform Module) only with Win 7; Option is not sold to China and Russia.",".",null,null,null,null,null,null,null,null,null,8,null,"24V DC industrial power supply and TPM",null,{"$f":"IF($P$14=2,1,\"\")","v":""}]
[]
[null,null,null,null,null,null,null,null,null,null,null,null,null,null,null,null,"Base device",null,1]
[]
[null,null,null,null,null,null,null,null,null,null,null,null,null,null,null,null,null,"Total:"]
[]
[]
[]
[]
[]
[]
["Accessories:"]
[null,null,null,null,null,null,null,null,null,null,null,null,null,null,null,null," "]
[]
["6ES7648-1AA22-0YM0",null,null,null,null,null,null,null," ",null,null,null,null,null,null,null,"Mounting set DIN-Rail for SIMATIC IPC427E"]
["6ES7648-1AA22-0YN0",null,null,null,null,null,null,null,null,null,null,null,null,null,null,null,"Mounting set Wall-mount for SIMATIC IPC427E"]
["6ES7648-1AA22-0YP0",null,null,null,null,null,null,null,null,null,null,null,null,null,null,null,"Mounting set Book-mount for SIMATIC IPC427E"]
[]
["6ES7648-2AK70-0PA0",null,null,null,null,null,null,null,null,null,null,null,null,null,null,null,"Speichererweiterung 8 GB DDR4 2400SDRAM, SODIMM "]
["6ES7648-2AK80-0PA0",null,null,null,null,null,null,null,null,null,null,null,null,null,null,null,"Speichererweiterung 16 GB DDR4 2400SDRAM, SODIMM "]
["6ES7648-2AK70-1PA0",null,null,null,null,null,null,null,null,null,null,null,null,null,null,null,"Speichererweiterung 8 GB DDR4 2400SDRAM, SODIMM with ECC"]
["6ES7648-2AK80-1PA0",null,null,null,null,null,null,null,null,null,null,null,null,null,null,null,"Speichererweiterung 16 GB DDR4 2400SDRAM, SODIMM with ECC"]
[null,null,null,null,null,null,null,null,null,null,null,null,null,null,null,null,"Adapter Cable"]
["6ES7648-3AF00-0XA0",null,null,null,null,null,null,null,null,null,null,null,null,null,null,null,"Adapter cable DisplayPort to DVI-D"]

{"sheet":"IPC BX-39A (Box PC)","index":16,"n_rows":112,"n_cols":19,"rows_kept":112,"cut":false,"hidden":false,"merged":[[0,17,3,17]]}
["SIMATIC IPC BX-39A (BoxPC)",null,null,null,null,null,null,null,null,null,null,null,null,null,null,null,{"$f":"$A$5&$B$5&$C$5&$D$5&$E$5&$F$5&$G$5&$H$5&$I$5&$J$5&$K$5&$L$5&$M$5&$N$5&$O$5","v":"6AG4142-1AA00-0AA0"}]
[null,null,null,null,null,null,null,null,null,null,null,null,null,null,null,null,{"$f":"$A$5&$B$5&$C$5&$D$5&$E$5&$F$5&$G$5&$H$5&$I$5&$J$5&$K$5&$L$5&$M$5&$N$5&$O$5","v":"6AG4142-1AA00-0AA0"}]
[null,null,{"$f":"IF(OR(F5=\"#\",G5=\"#\",H5=\"#\",I5=\"#\",J5=\"#\",L5=\"#\",M5=\"#\",N5=\"#\",P5=\"#\",O5=\"#\"),1,0)","v":0},"Configuration not possible. Mind the combinations of the options",null,null,null,null,null,null,null,null,null,null,null,null,{"$f":"IF(C3, D3,\"\")","v":""}]
[" ",null,null,null,null,8,9,10,11,12,null,13,14,15,16,null," "]
["6AG4",1,4,2,"-",{"$f":"VLOOKUP(P7,A21:Q24,6,TRUE)","v":1},{"$f":"VLOOKUP(P8,A27:Q36,7,TRUE)","v":"A"},{"$f":"VLOOKUP(P9,A39:Q49,8,TRUE)","v":"A"},{"$f":"VLOOKUP(P10,A52:Q58,9,TRUE)","v":0},{"$f":"VLOOKUP(P11,A61:Q66,10,TRUE)","v":"0"},"-",{"$f":"VLOOKUP(P12,A69:Q72,12,FALSE)","v":0},{"$f":"VLOOKUP(P13,A75:Q76,13,TRUE)","v":"A"},{"$f":"VLOOKUP(P14,A79:Q81,14,TRUE)","v":"A"},{"$f":"VLOOKUP(P15,A84:Q86,15,TRUE)","v":0},null,{"$f":" \"SIMATIC IPC BX-39A\" & \" (Box PC)\"","v":"SIMATIC IPC BX-39A (Box PC)"},{"$f":"T(Q2)","v":"6AG4142-1AA00-0AA0"}]
[null,null,null,"|",null,"|","|","|","|","|",null,"|","|","|","|",1,{"$f":"VLOOKUP(P6,A18:Q18,17,FALSE)","v":"Standard-Device"}]
[null,null,null,"|",null,"|","|","|","|","|",null,"|","|","|","|",1,{"$f":"VLOOKUP(P7,A21:Q24,17,FALSE)","v":"Intel Celeron 6600HLE (2,1 GHz, 2C/2T)"}," "]
[null,null,null,"|",null,"|","|","|","|","|",null,"|","|","|","|",1,{"$f":"VLOOKUP(P8,A27:Q36,17,FALSE)","v":"without mounting material"}]
[null,null,null,"|",null,"|","|","|","|","|",null,"|","|","|","|",1,{"$f":"VLOOKUP(P9,A39:Q49,17,FALSE)","v":"4GB"}]
[null,null,null,"|",null,"|","|","|","|","|",null,"|","|","|","|",1,{"$f":"VLOOKUP(P10,A52:Q58,17,FALSE)","v":"without 1st mass-storage"}]
[null,null,null,"|",null,"|","|","|","|","|",null,"|","|","|","|",1,{"$f":"VLOOKUP(P11,A61:Q66,17,FALSE)","v":"without 2nd mass-storage"},"Link utili"]
[null,null,null,"|",null,"|","|","|","|","|",null,"|","|","|","|",1,{"$f":"VLOOKUP(P12,A69:Q72,17,FALSE)","v":"without operating system"},"Certificati"]
[null,null,null,"|",null,"|","|","|","|","|",null,"|","|","|","|",1,{"$f":"VLOOKUP(P13,A75:Q76,17,FALSE)","v":"without Option 1"},"Datasheet"]
[null,null,null,"|",null,"|","|","|","|","|",null,"|","|","|","|",1,{"$f":"VLOOKUP(P14,A79:Q81,17,FALSE)","v":"without USB-Stick (Restore-Image; D&D)"},"Manuale"]
[null,null,null,"|",null,"|","|","|","|","|",null,"|","|","|","|",1,{"$f":"VLOOKUP(P15,A84:Q86,17,FALSE)","v":"24V DC Industry-power supply (Premium, NAU, isolated,\"Überbrückungszeit\")"},"CAD 2D/3D"]
[null,null,null,"|",null,"|","|","|","|","|",null,"|","|","|","|",null," "]
[null,null,null,"|",null,"|","|","|","|","|",null,"|","|","|","|",null,"Device"]
[1,null,null,2,null,"|","|","|","|","|",null,"|","|","|","|",null,"Standard-Device",null,{"$f":"IF($P$6=1,1,\"\")","v":1}]
[null,null,null,null,null,"|","|","|","|","|",null,"|","|","|","|"]
[null,null,null,null,null,"|","|","|","|","|",null,"|","|","|","|",null,"Processor"]
[1,null,null,null,null,1,"|","|","|","|",null,"|","|","|","|",null,"Intel Celeron 6600HLE (2,1 GHz, 2C/2T)",null,{"$f":"IF($P$7=1,1,\"\")","v":1}]
[2,null,null,null,null,3,"|","|","|","|",null,"|","|","|","|",null,"Intel Xeon W-11155MLE (1,8/3,1 GHz, 4C/8T)",null,{"$f":"IF($P$7=2,1,\"\")","v":""}]
[3,null,null,null,null,5,"|","|","|","|",null,"|","|","|","|",null,"Intel Xeon W-11555MLE (1,9/4,4 GHz, 6C/12T)",null,{"$f":"IF($P$7=3,1,\"\")","v":""}]
[4,null,null,null,null,7,"|","|","|","|",null,"|","|","|","|",null,"Intel Xeon W-11865MLE (1,5/4,5 GHz, 8C/16T)",null,{"$f":"IF($P$7=4,1,\"\")","v":""}]
[null,null,null,null,null,null,"|","|","|","|",null,"|","|","|","|"]
[null,null,null,null,null,null,"|","|","|","|",null,"|","|","|","|",null,"Mounting"]
[1,null,null,null,null,null,"A","|","|","|",null,"|","|","|","|",null,"without mounting material",null,{"$f":"IF($P$8=1,1,\"\")","v":1}]
[2,null,null,null,null,null,"B","|","|","|",null,"|","|","|","|",null,"DIN-Rail",null,{"$f":"IF($P$8=2,1,\"\")","v":""}]
[3,null,null,null,null,null,"C","|","|","|",null,"|","|","|","|",null,"Wall-mount",null,{"$f":"IF($P$8=3,1,\"\")","v":""}]
[4,null,null,null,null,null,"D","|","|","|",null,"|","|","|","|",null,"Book-mount",null,{"$f":"IF($P$8=4,1,\"\")","v":""}]
[5,null,null,null,null,null,"F","|","|","|",null,"|","|","|","|",null,"1 x PCIe and DIN-Rail",null,{"$f":"IF($P$8=5,1,\"\")","v":""}]
[6,null,null,null,null,null,"G","|","|","|",null,"|","|","|","|",null,"1 x PCIe and Wall-mount",null,{"$f":"IF($P$8=6,1,\"\")","v":""}]
[7,null,null,null,null,null,"H","|","|","|",null,"|","|","|","|",null,"1 x PCIe and Book-mount",null,{"$f":"IF($P$8=7,1,\"\")","v":""}]
[8,null,null,null,null,null,"J","|","|","|",null,"|","|","|","|",null,"2 x PCIe and DIN-Rail",null,{"$f":"IF($P$8=8,1,\"\")","v":""}]
[9,null,null,null,null,null,"K","|","|","|",null,"|","|","|","|",null,"2 x PCIe and Wall-mount",null,{"$f":"IF($P$8=9,1,\"\")","v":""}]
[10,null,null,null,null,null,"L","|","|","|",null,"|","|","|","|",null,"2 x PCIe and Book-mount",null,{"$f":"IF($P$8=10,1,\"\")","v":""}]
[" ",null,null,null,null,null,null,"|","|","|",null,"|","|","|","|"]
[null,null,null,null,null,null," ","|","|","|",null,"|","|","|","|",null,"RAM"]
[1,null,null,null,null,null,null,"A","|","|",null,"|","|","|","|",null,"4GB",null,{"$f":"IF($P$9=1,1,\"\")","v":1}]
[2,null,null,null,null,null,null,"B","|","|",null,"|","|","|","|",null,"8GB",null,{"$f":"IF($P$9=2,1,\"\")","v":""}]
[3,null,null,null,null,null,null,"C","|","|",null,"|","|","|","|",null,"16GB",null,{"$f":"IF($P$9=3,1,\"\")","v":""}]
[4,null,null,null,null,null,null,"D","|","|",null,"|","|","|","|",null,"32GB",null,{"$f":"IF($P$9=4,1,\"\")","v":""}]
[5,null,null,null,null,null,null,"E","|","|",null,"|","|","|","|",null,"16GB with ECC",null,{"$f":"IF($P$9=5,1,\"\")","v":""}]
[6,null,null,null,null,null,null,"F","|","|",null,"|","|","|","|",null,"32GB with ECC",null,{"$f":"IF($P$9=6,1,\"\")","v":""}]
[7,null,null,null,null,null,null,"G","|","|",null,"|","|","|","|",null,"8GB and NVRAM (M.2 Modul)",null,{"$f":"IF($P$9=7,1,\"\")","v":""}]
[8,null,null,null,null,null,null,"H","|","|",null,"|","|","|","|",null,"16GB and NVRAM (M.2 Modul)",null,{"$f":"IF($P$9=8,1,\"\")","v":""}]
[9,null,null,null,null,null,null,"J","|","|",null,"|","|","|","|",null,"32GB and NVRAM (M.2 Modul)",null,{"$f":"IF($P$9=9,1,\"\")","v":""}]
[10,null,null,null,null,null,null,"K","|","|",null,"|","|","|","|",null,"16GB with ECC and NVRAM (M.2 Modul)",null,{"$f":"IF($P$9=10,1,\"\")","v":""}]
[11,null,null,null,null,null,null,"L","|","|",null,"|","|","|","|",null,"32GB with ECC and NVRAM (M.2 Modul)",null,{"$f":"IF($P$9=11,1,\"\")","v":""}]
[null,null,null,null,null,null,null,null,"|","|",null,"|","|","|","|",null," "]
[null,null,null,null,null,null,null,null,"|","|",null,"|","|","|","|",null,"Drive 1 in Simatic IPC Slider (incl. OS)"]
[1,null,null,null,null,null,null,null,0,"|",null,"|","|","|","|",null,"without 1st mass-storage",null,{"$f":"IF($P$10=1,1,\"\")","v":1}]
[2," ",null,null,null,null,null,null,1,"|",null,"|","|","|","|",null,"M.2 SSD 256 GB Eco",null,{"$f":"IF($P$10=2,1,\"\")","v":""}]
[3,null,null,null,null,null,null,null,2,"|",null,"|","|","|","|",null,"M.2 SSD 512 GB Eco",null,{"$f":"IF($P$10=3,1,\"\")","v":""}]
[4,null,null,null,null,null,null,null,4,"|",null,"|","|","|","|",null,"M.2 SSD 240 GB",null,{"$f":"IF($P$10=4,1,\"\")","v":""}]
[5,null,null,null,null,null,null,null,5,"|",null,"|","|","|","|",null,"M.2 SSD 480 GB",null,{"$f":"IF($P$10=5,1,\"\")","v":""}]
[6,null,null,null,null,null,null,null,6,"|",null,"|","|","|","|",null,"M.2 SSD 960 GB",null,{"$f":"IF($P$10=6,1,\"\")","v":""}]
[7,null,null,null,null,null,null,null,8,"|",null,"|","|","|","|",null,"RAID1 with SSD 512 GB Eco (SSD 2 with  512 GB Eco necessary)",null,{"$f":"IF($P$10=7,1,\"\")","v":""}]
[null,null,null,null,null,null,null,null,null,"|",null,"|","|","|","|"]
[null,null,null,null,null,null,null,null,null,"|",null,"|","|","|","|",null,"Drive 2 in Simatic IPC Slider"]
[1,null,null,null,null,null,null,null,null,{"$f":"IF(OR($P$10=7),\"#\",\"0\")","v":"0"},null,"|","|","|","|",null,"without 2nd mass-storage",null,{"$f":"IF($P$11=1,1,\"\")","v":1}]
[2,null,null,null,null,null,null,null,null,{"$f":"IF(OR($P$10=1, $P$10=7),\"#\",\"1\")","v":"#"},null,"|","|","|","|",null,"M.2 SSD 256 GB Eco",null,{"$f":"IF($P$11=2,1,\"\")","v":""}]
[3,null,null,null,null,null,null,null,null,{"$f":"IF(OR($P$10=1, $P$10=8),\"#\",\"2\")","v":"#"},null,"|","|","|","|",null,"M.2 SSD 512 GB Eco",null,{"$f":"IF($P$11=3,1,\"\")","v":""}]
[4,null,null,null,null,null,null,null,null,{"$f":"IF(OR($P$10=1, $P$10=7),\"#\",\"4\")","v":"#"},null,"|","|","|","|",null,"M.2 SSD 240 GB",null,{"$f":"IF($P$11=4,1,\"\")","v":""}]
[5,null,null,null,null,null,null,null,null,{"$f":"IF(OR($P$10=1, $P$10=7),\"#\",\"5\")","v":"#"},null,"|","|","|","|",null,"M.2 SSD 480 GB",null,{"$f":"IF($P$11=5,1,\"\")","v":""}]
[6,null,null,null,null,null,null,null,null,{"$f":"IF(OR($P$10=1, $P$10=7),\"#\",\"6\")","v":"#"},null,"|","|","|","|",null,"M.2 SSD 960 GB",null,{"$f":"IF($P$11=6,1,\"\")","v":""}]
[" ",null,null,null,null,null,null,null,null,null,null,"|","|","|","|"]
[null,null,null,null,null,null,null,null,null,null,null,"|","|","|","|",null,"Software configuration"]
[1,null,null,null,null,null,null,null,null,null,null,0,"|","|","|",null,"without operating system",null,{"$f":"IF($P$12=1,1,\"\")","v":1}]
[2,null,null,null,null,null,null,null,null,null,null,{"$f":"IF(OR(($P$10=1),($P$7=4)),\"#\",\"1\")","v":"#"},"|","|","|",null,"Windows 10 IoT Enterprise 2021 LTSC with processors Celeron, W-11155MLE, W-11555MLE",null,{"$f":"IF($P$12=2,1,\"\")","v":""}]
[3,null,null,null,null,null,null,null,null,null,null,{"$f":"IF(OR(($P$10=1),($P$7<4)),\"#\",\"2\")","v":"#"},"|","|","|",null,"Windows 10 IoT Enterprise 2021 LTSC with processor W-11865MLE",null,{"$f":"IF($P$12=3,1,\"\")","v":""}]
[4,null,null,null,null,null,null,null,null,null,null,{"$f":"IF(OR($P$10=1,$P$10=8, $P$10=9),\"#\",\"7\")","v":"#"},"|","|","|",null,"SIMATIC Industrial OS",null,{"$f":"IF($P$12=4,1,\"\")","v":""}]
[null,null,null,null,null,null,null,null,null,null,null,null,"|","|","|"]
[null,null,null,null,null,null," ",null,null,null,null,null,"|","|","|",null,"Option 1"]
[1,null,null,null,null,null,null,null,null,null," ",null,"A","|","|",null,"without Option 1",null,{"$f":"IF($P$13=1,1,\"\")","v":1}]
[2,null,null,null,null,null,null,null,null,null,null,null,"B","|","|",null,"additive 1 x Com (RS232/485/422) (2 in total)",null,{"$f":"IF($P$13=2,1,\"\")","v":""}]
[null,null,null,null,null,null,null,null,null,null,null,null,null,"|","|"]
[null,null,null,null,null,null,null,null,null,null,null,null,null,"|","|",null,"Option 2"]
[1,null,null,null,null,null," "," "," "," "," "," "," ","A","|",null,"without USB-Stick (Restore-Image; D&D)",null,{"$f":"IF($P$14=1,1,\"\")","v":1}]
[2,null,null,null,null,null,null,null,null,null,null,null,null,{"$f":"IF(OR($P$12=8),\"#\",\"B\")","v":"B"},"|",null,"with USB-Stick (Restore-Image; D&D)",null,{"$f":"IF($P$14=2,1,\"\")","v":""}]
[3,null,null,null,null,null,null,null,null,null,null,null,null,{"$f":"IF(OR($P$7=1,$P$9=1,$P$9=5,$P$9=6,$P$9=7,$P$9=8,$P$9=9,$P$9=10,$P$9=11,$P$10=1,$P$10=8,$P$10=9,$P$11>1,$P$12>1,$P$13>2),\"#\",\"W\")","v":"#"},"|",null,"Industrial Edge - SIMATIC",null,{"$f":"IF($P$14=3,1,\"\")","v":""}]
[null,null,null,null,null,null," "," "," "," "," "," "," "," ","|"," ",null,null," "]
[null,null,null,null,null,null," "," "," "," "," "," "," ",null,"|",null,"Power Supply"]
[1,null,null,null,null,null,null,null,null,null,null,null,null,null,0,null,"24V DC Industry-power supply (Premium, NAU, isolated,\"Überbrückungszeit\")",null,{"$f":"IF($P$15=1,1,\"\")","v":1}]
[2,null,null,null,null,null,null,null,null,null,null,null,null,null,7,null,"24V DC Industry-power supply (Premium, NAU, isolated,\"Überbrückungszeit\") with ATEX",null,{"$f":"IF($P$15=2,1,\"\")","v":""}]
[]
[null,null,null,null,null,null,null,null,null,null,null,null,null,null,null,null,"Base device",null,1]
[]
[null,null,null,null,null,null,null,null,null,null,null,null,null,null,null,null,null,"Total:"]
[]
[]
[]
["Accessories"]
["6ES7648-0EK00-0GA1",null,null,null,null,null,null,null,null,null,null,null,null,null,null,null,"SIMATIC IPC Slider (long) for M.2 SSD, without SSD"]
["6ES7648-0EK10-0GA3",null,null,null,null,null,null,null,null,null,null,null,null,null,null,null,"SIMATIC IPC Slider (long) für M.2 SSD, with 256 GB Eco"]
["6ES7648-0EK20-0GA3",null,null,null,null,null,null,null,null,null,null,null,null,null,null,null,"SIMATIC IPC Slider (long) für M.2 SSD, with 512 GB Eco"]
["6ES7648-0EK10-0GA2",null,null,null,null,null,null,null,null,null,null,null,null,null,null,null,"SIMATIC IPC Slider (long) für M.2 SSD, with 240 GB PLP"]
["6ES7648-0EK20-0GA2",null,null,null,null,null,null,null,null,null,null,null,null,null,null,null,"SIMATIC IPC Slider (long) für M.2 SSD, with 480 GB PLP"]
["6ES7648-0EK30-0GA2",null,null,null,null,null,null,null,null,null,null,null,null,null,null,null,"SIMATIC IPC Slider (long) für M.2 SSD, with 960 GB PLP"]
["6ES7648-2AK70-0RA0",null,null,null,null,null,null,null,null,null,null,null,null,null,null,null,"Memory extension 8 GB (1x 8 GB) DDR4 3200, SDRAM, SO-DIMM"]
["6ES7648-2AK80-0RA0",null,null,null,null,null,null,null,null,null,null,null,null,null,null,null,"Memory extension 16 GB (1x 16 GB) DDR4 3200, SDRAM, SO-DIMM"]
["6ES7648-2AK81-0RA0",null,null,null,null,null,null,null,null,null,null,null,null,null,null,null,"Memory extension 32 GB (1x 32 GB) DDR4 3200, SDRAM, SO-DIMM"]
["6ES7648-2AK80-1RA0",null,null,null,null,null,null,null,null,null,null,null,null,null,null,null,"Memory extension 16 GB (1x 16 GB) DDR4 3200, SDRAM, SO-DIMM with ECC"]
["6ES7648-2AK81-1RA0",null,null,null,null,null,null,null,null,null,null,null,null,null,null,null,"Memory extension 32 GB (1x 32 GB) DDR4 3200, SDRAM, SO-DIMM with ECC"]
["6ES7648-1AA22-0YM0",null,null,null,null,null,null,null,null,null,null,null,null,null,null,null,"Mounting accessory DIN-rail IPC BX-39A and IPC 427E"]
["6ES7648-1AA22-0YN0",null,null,null,null,null,null,null,null,null,null,null,null,null,null,null,"Mounting accessory wall mount IPC BX-39A"]
["6ES7648-1AA22-0YP0",null,null,null,null,null,null,null,null,null,null,null,null,null,null,null,"Mounting accessory book mount IPC BX-39A"]
["6ES7648-1AA20-0YL0",null,null,null,null,null,null,null,null,null,null,null,null,null,null,null,"Mounting accessory cable relief IPC BX-39A"]
["6ES7648-1AA22-0YQ0",null,null,null,null,null,null,null,null,null,null,null,null,null,null,null,"Mounting accessory DIN-rail SE IPC BX-39A and IPC 427E"]
["6ES7648-1AD22-0YM0",null,null,null,null,null,null,null,null,null,null,null,null,null,null,null,"Mounting accessory DIN-rail IPC BX-39A and IPC 427E 25x"]
[]
["6ES7648-2CF10-1AA0",null,null,null,null,null,null,null,null,null,null,null,null,null,null,null,"SIMATIC CP1625, PCIe card for PROFINET IRT for Softwarecontroller CPU1500S"]

{"sheet":"IPC BX-32A (Box)","index":17,"n_rows":77,"n_cols":19,"rows_kept":77,"cut":false,"hidden":false,"merged":[[0,17,3,17]]}
["SIMATIC IPC BX-32A (BoxPC)"]
[null,null,null,null,null,null,null,null,null,null,null,null,null,null,null,null,{"$f":"$A$5&$B$5&$C$5&$D$5&$E$5&$F$5&$G$5&$H$5&$I$5&$J$5&$K$5&$L$5&$M$5&$N$5&$O$5","v":"6AG4152-1AA00-0AB1"}]
[]
[" ",null,null,null,null,8,9,10,11,12,null,13,14,15,16,null," "]
["6AG4",1,5,2,"-",{"$f":"VLOOKUP(P7,A21:Q24,6,TRUE)","v":1},{"$f":"VLOOKUP(P8,A27:Q33,7,TRUE)","v":"A"},{"$f":"VLOOKUP(P9,A36:Q39,8,TRUE)","v":"A"},{"$f":"VLOOKUP(P10,A42:Q44,9,TRUE)","v":0},{"$f":"VLOOKUP(P11,A47:Q47,10,TRUE)","v":0},"-",{"$f":"VLOOKUP(P12,A50:Q52,12,FALSE)","v":0},{"$f":"VLOOKUP(P13,A55:Q57,13,TRUE)","v":"A"},{"$f":"VLOOKUP(P14,A60:Q60,14,TRUE)","v":"B"},{"$f":"VLOOKUP(P15,A63:Q63,15,TRUE)","v":1},null,{"$f":" \"SIMATIC IPC BX-32A\" & \" (Box PC)\"","v":"SIMATIC IPC BX-32A (Box PC)"},{"$f":"T(Q2)","v":"6AG4152-1AA00-0AB1"}]
[null,null,null,"|",null,"|","|","|","|","|",null,"|","|","|","|",1,{"$f":"VLOOKUP(P6,A18:Q18,17,FALSE)","v":"Standard-Device"}]
[null,null,null,"|",null,"|","|","|","|","|",null,"|","|","|","|",1,{"$f":"VLOOKUP(P7,A21:Q24,17,FALSE)","v":"Intel Celeron 6600HLE (2,1 GHz, 2C/2T)"}," "]
[null,null,null,"|",null,"|","|","|","|","|",null,"|","|","|","|",1,{"$f":"VLOOKUP(P8,A27:Q33,17,FALSE)","v":"without mounting material"}]
[null,null,null,"|",null,"|","|","|","|","|",null,"|","|","|","|",1,{"$f":"VLOOKUP(P9,A36:Q39,17,FALSE)","v":"4GB"}]
[null,null,null,"|",null,"|","|","|","|","|",null,"|","|","|","|",1,{"$f":"VLOOKUP(P10,A42:Q44,17,FALSE)","v":"without 1st mass-storage"}]
[null,null,null,"|",null,"|","|","|","|","|",null,"|","|","|","|",1,{"$f":"VLOOKUP(P11,A47:Q47,17,FALSE)","v":"without 2nd mass-storage"},"Link utili"]
[null,null,null,"|",null,"|","|","|","|","|",null,"|","|","|","|",1,{"$f":"VLOOKUP(P12,A50:Q52,17,FALSE)","v":"without operating system"},"Certificati"]
[null,null,null,"|",null,"|","|","|","|","|",null,"|","|","|","|",1,{"$f":"VLOOKUP(P13,A55:Q57,17,FALSE)","v":"without Option 1"},"Datasheet"]
[null,null,null,"|",null,"|","|","|","|","|",null,"|","|","|","|",1,{"$f":"VLOOKUP(P14,A60:Q60,17,FALSE)","v":"with USB-Stick (Restore-Image; D&D)"},"Manuale"]
[null,null,null,"|",null,"|","|","|","|","|",null,"|","|","|","|",1,{"$f":"VLOOKUP(P15,A63:Q63,17,FALSE)","v":"9-36V DC Industry-power supply (wide range)"},"CAD 2D/3D"]
[null,null,null,"|",null,"|","|","|","|","|",null,"|","|","|","|",null," "]
[null,null,null,"|",null,"|","|","|","|","|",null,"|","|","|","|",null,"Device"]
[1,null,null,2,null,"|","|","|","|","|",null,"|","|","|","|",null,"Standard-Device",null,{"$f":"IF($P$6=1,1,\"\")","v":1}]
[null,null,null,null,null,"|","|","|","|","|",null,"|","|","|","|"]
[null,null,null,null,null,"|","|","|","|","|",null,"|","|","|","|",null,"Processor"]
[1,null,null,null,null,1,"|","|","|","|",null,"|","|","|","|",null,"Intel Celeron 6600HLE (2,1 GHz, 2C/2T)",null,{"$f":"IF($P$7=1,1,\"\")","v":1}]
[2,null,null,null,null,3,"|","|","|","|",null,"|","|","|","|",null,"Intel Xeon W-11155MLE (1,8/3,1 GHz, 4C/8T)",null,{"$f":"IF($P$7=2,1,\"\")","v":""}]
[3,null,null,null,null,5,"|","|","|","|",null,"|","|","|","|",null,"Intel Xeon W-11555MLE (1,9/4,4 GHz, 6C/12T)",null,{"$f":"IF($P$7=3,1,\"\")","v":""}]
[4,null,null,null,null,7,"|","|","|","|",null,"|","|","|","|",null,"Intel Xeon W-11865MLE (1,5/4,5 GHz, 8C/16T)",null,{"$f":"IF($P$7=4,1,\"\")","v":""}]
[null,null,null,null,null,null,"|","|","|","|",null,"|","|","|","|"]
[null,null,null,null,null,null,"|","|","|","|",null,"|","|","|","|",null,"Mounting"]
[1,null,null,null,null,null,"A","|","|","|",null,"|","|","|","|",null,"without mounting material",null,{"$f":"IF($P$8=1,1,\"\")","v":1}]
[2,null,null,null,null,null,"B","|","|","|",null,"|","|","|","|",null,"DIN-Rail",null,{"$f":"IF($P$8=2,1,\"\")","v":""}]
[3,null,null,null,null,null,"C","|","|","|",null,"|","|","|","|",null,"Wall-mount",null,{"$f":"IF($P$8=3,1,\"\")","v":""}]
[4,null,null,null,null,null,"D","|","|","|",null,"|","|","|","|",null,"Book-mount",null,{"$f":"IF($P$8=4,1,\"\")","v":""}]
[5,null,null,null,null,null,"F","|","|","|",null,"|","|","|","|",null,"DIN-Rail and 1 x PCIe",null,{"$f":"IF($P$8=5,1,\"\")","v":""}]
[6,null,null,null,null,null,"G","|","|","|",null,"|","|","|","|",null,"Wall-mount and 1 x PCIe",null,{"$f":"IF($P$8=6,1,\"\")","v":""}]
[7,null,null,null,null,null,"H","|","|","|",null,"|","|","|","|",null,"Book-mount and 1 x PCIe",null,{"$f":"IF($P$8=7,1,\"\")","v":""}]
[" ",null,null,null,null,null,null,"|","|","|",null,"|","|","|","|"]
[null,null,null,null,null,null," ","|","|","|",null,"|","|","|","|",null,"RAM"]
[1,null,null,null,null,null,null,"A","|","|",null,"|","|","|","|",null,"4GB",null,{"$f":"IF($P$9=1,1,\"\")","v":1}]
[2,null,null,null,null,null,null,"B","|","|",null,"|","|","|","|",null,"8GB",null,{"$f":"IF($P$9=2,1,\"\")","v":""}]
[3,null,null,null,null,null,null,"C","|","|",null,"|","|","|","|",null,"16GB",null,{"$f":"IF($P$9=3,1,\"\")","v":""}]
[4,null,null,null,null,null,null,"D","|","|",null,"|","|","|","|",null,"32GB",null,{"$f":"IF($P$9=4,1,\"\")","v":""}]
[null,null,null,null,null,null,null,null,"|","|",null,"|","|","|","|",null," "]
[null,null,null,null,null,null,null,null,"|","|",null,"|","|","|","|",null,"Drive 1 (incl. OS)"]
[1,null,null,null,null,null,null,null,0,"|",null,"|","|","|","|",null,"without 1st mass-storage",null,{"$f":"IF($P$10=1,1,\"\")","v":1}]
[2," ",null,null,null,null,null,null,1,"|",null,"|","|","|","|",null,"M.2 SSD 256 GB Eco",null,{"$f":"IF($P$10=2,1,\"\")","v":""}]
[3,null,null,null,null,null,null,null,2,"|",null,"|","|","|","|",null,"M.2 SSD 512 GB Eco",null,{"$f":"IF($P$10=3,1,\"\")","v":""}]
[null,null,null,null,null,null,null,null,null,"|",null,"|","|","|","|"]
[null,null,null,null,null,null,null,null,null,"|",null,"|","|","|","|",null,"Drive 2 "]
[1,null,null,null,null,null,null,null,null,0,null,"|","|","|","|",null,"without 2nd mass-storage",null,{"$f":"IF($P$11=1,1,\"\")","v":1}]
[" ",null,null,null,null,null,null,null,null,null,null,"|","|","|","|"]
[null,null,null,null,null,null,null,null,null,null,null,"|","|","|","|",null,"Software configuration"]
[1,null,null,null,null,null,null,null,null,null,null,0,"|","|","|",null,"without operating system",null,{"$f":"IF($P$12=1,1,\"\")","v":1}]
[2,null,null,null,null,null,null,null,null,null,null,{"$f":"IF(OR(($P$10=1),($P$7=4)),\"#\",\"1\")","v":"#"},"|","|","|",null,"Windows 10 IoT Enterprise 2021 LTSC with processors Celeron, W-11155MLE, W-11555MLE",null,{"$f":"IF($P$12=2,1,\"\")","v":""}]
[3,null,null,null,null,null,null,null,null,null,null,{"$f":"IF(OR(($P$10=1),($P$7<4)),\"#\",\"2\")","v":"#"},"|","|","|",null,"Windows 10 IoT Enterprise 2021 LTSC with processor W-11865MLE",null,{"$f":"IF($P$12=3,1,\"\")","v":""}]
[null,null,null,null,null,null,null,null,null,null,null,null,"|","|","|"]
[null,null,null,null,null,null," ",null,null,null,null,null,"|","|","|",null,"Option 1"]
[1,null,null,null,null,null,null,null,null,null," ",null,"A","|","|",null,"without Option 1",null,{"$f":"IF($P$13=1,1,\"\")","v":1}]
[2,null,null,null,null,null,null,null,null,null,null,null,"B","|","|",null,"additiv 1 x Com (RS232) (3 in total)",null,{"$f":"IF($P$13=2,1,\"\")","v":""}]
[3,null,null,null,null,null,null,null,null,null,null,null,"C","|","|",null,"additiv 2 x Com (RS232) (4 in total)",null,{"$f":"IF($P$13=3,1,\"\")","v":""}]
[null,null,null,null,null,null,null,null,null,null,null,null,null,"|","|"]
[null,null,null,null,null,null,null,null,null,null,null,null,null,"|","|",null,"Option 2"]
[1,null,null,null,null,null,null,null,null,null,null,null,null,"B","|",null,"with USB-Stick (Restore-Image; D&D)",null,1]
[null,null,null,null,null,null," "," "," "," "," "," "," "," ","|"," ",null,null," "]
[null,null,null,null,null,null," "," "," "," "," "," "," ",null,"|",null,"Power Supply"]
[1,null,null,null,null,null,null,null,null,null,null,null,null,null,1,1,"9-36V DC Industry-power supply (wide range)",null,1]
[null,null,null,null,null,null,null,null,null,null,null,null,null,null,null,null,"Base",null,1]
[]
[null,null,null,null,null,null,null,null,null,null,null,null,null,null,null,null,null,"Total:"]
[]
[]
[]
["Accessories:"]
["6ES7648-2AK70-0RA0",null,null,null,null,null,null,null,null,null,null,null,null,null,null,null,"Memory expansion 8 GB (1x 8 GB) DDR4 3200, SDRAM, SO-DIMM"]
["6ES7648-2AK80-0RA0",null,null,null,null,null,null,null,null,null,null,null,null,null,null,null,"Memory expansion 16 GB (1x 16 GB) DDR4 3200, SDRAM, SO-DIMM"]
["6ES7648-2AK81-0RA0",null,null,null,null,null,null,null,null,null,null,null,null,null,null,null,"Memory expansion 32 GB (1x 32 GB) DDR4 3200, SDRAM, SO-DIMM"]
["6ES7648-1AA23-0YM0",null,null,null,null,null,null,null,null,null,null,null,null,null,null,null,"Mounting expansion DIN-rail IPC BX-32A"]
["6ES7648-1AA23-0YN0",null,null,null,null,null,null,null,null,null,null,null,null,null,null,null,"Mounting accessory wall mount IPC BX-32A"]
["6ES7648-1AA23-0YP0",null,null,null,null,null,null,null,null,null,null,null,null,null,null,null,"Mounting accessory book mount IPC BX-32A"]
["6ES7648-1AA21-0YL0",null,null,null,null,null,null,null,null,null,null,null,null,null,null,null,"Mounting accessory cable relief IPC BX-32A"]

{"sheet":"IPC BX-56A","index":18,"n_rows":73,"n_cols":19,"rows_kept":73,"cut":false,"hidden":false,"merged":[[0,17,3,17]]}
["SIMATIC IPC BX-56A (BoxPC)",null,null,null,null,null,null,null,null,null,null,null,null,null,null,null,{"$f":"$A$5&$B$5&$C$5&$D$5&$E$5&$F$5&$G$5&$H$5&$I$5&$J$5&$K$5&$L$5&$M$5&$N$5&$O$5","v":"6AG4132-0AA00-0AX7"}]
[null,null,null,null,null,null,null,null,null,null,null,null,null,null,null,null,{"$f":"IF(E22,F22,\"\")&IF(E23,F23,\"\")&IF(E24,F24,\"\")&IF(E33,F33,\"\")&IF(E34,F34,\"\")&IF(E35,F35,\"\")&IF(E39,F39,\"\")&IF(E40,F40,\"\")&IF(E41,F41,\"\")&IF(E42,F42,\"\")&IF(E47,F47,\"\")&IF(E57,F57,\"\")&IF(E61,F61,\"\")&IF(E64,F64,\"\")&IF(E65,F65,\"\")","v":""}]
[null,null,{"$f":"IF(OR(F5=\"#\",G5=\"#\",H5=\"#\",I5=\"#\",J5=\"#\",L5=\"#\",M5=\"#\",N5=\"#\",P5=\"#\",O5=\"#\"),1,0)","v":0},"Configuration not possible. Mind the combinations of the options"]
[" ",null,null,null,null,null,null,null,null,null,null,null,null,null,null,null," "]
["6AG4",1,3,2,"-",0,{"$f":"INDEX(G22:G30,P6)","v":"A"},{"$f":"INDEX(H33:H36,P7)","v":"A"},{"$f":"INDEX(I39:I43,P8)","v":0},{"$f":"INDEX(J46:J47,P9)","v":"0"},"-",{"$f":"INDEX(L50:L50,P10)","v":0},{"$f":"INDEX(M53:M57,P11)","v":"A"},{"$f":"INDEX(N60:N61,P12)","v":"X"},{"$f":"INDEX(O64:O65,P13)","v":7},null,{"$f":" \"SIMATIC IPC BX-56A\" & \" (Modular Box PC)\"","v":"SIMATIC IPC BX-56A (Modular Box PC)"},{"$f":"A5&B5&C5&D5&E5&F5&G5&H5&I5&J5&K5&L5&M5&N5&O5","v":"6AG4132-0AA00-0AX7"}]
[null,null,null,null,null,null,"|","|","|","|",null,"|","|","|","|",1,{"$f":"INDEX(Q22:Q30,P6)","v":"Pentium G7400E, 65W; 2C(2P+0E)4T, 3.6 GHz; with 9-36VDC, 220W power supply"}]
[null,null,null,null,null,null,"|","|","|","|",null,"|","|","|","|",1,{"$f":"INDEX(Q33:Q36,P7)","v":"Base module without driver"}," "]
[null,null,null,null,null,null,"|","|","|","|",null,"|","|","|","|",1,{"$f":"INDEX(Q39:Q43,P8)","v":"8 GB DDR5(1*8)"}]
[null,null,null,null,null,null,"|","|","|","|",null,"|","|","|","|",1,{"$f":"INDEX(Q46:Q47,P9)","v":"without hardware extension"}]
[null,null,null,null,null,null,"|","|","|","|",null,"|","|","|","|",1,{"$f":"INDEX(Q50:Q445,P10)","v":"No power cord"}]
[null,null,null,null,null,null,"|","|","|","|",null,"|","|","|","|",1,{"$f":"INDEX(Q53:Q57,P11)","v":"BM without operating system (without USB-Stick D&D)"}]
[null,null,null,null,null,null,"|","|","|","|",null,"|","|","|","|",2,{"$f":"INDEX(Q60:Q61,P12)","v":"No Extension Module"}]
[null,null,null,null,null,null,"|","|","|","|",null,"|","|","|","|",2,{"$f":"INDEX(Q64:Q65,P13)","v":"No Extension Module, no EM storage"}]
[null,null,null,null,null,null,"|","|","|","|",null,"|","|","|","|",1,"Mainboard (Chipset H610E);"]
[null,null,null,null,null,null,"|","|","|","|",null,"|","|","|","|",null,"2x DP; Audio; 2x SIM slots","Link utili"]
[null,null,null,null,null,null,"|","|","|","|",null,"|","|","|","|",null,"2x Gigabit Ethernet (IE/PN) RJ45;","Certificati"]
[null,null,null,null,null,null,"|","|","|","|",null,"|","|","|","|",null,"4x USB 3.1 Gen.2; 2x seriell (COM1);","Datasheet"]
[null,null,null,null,null,null,"|","|","|","|",null,"|","|","|","|",null,"2x M.2 flex modules slots onboard;","Manuale"]
[null,null,null,null,null,null,"|","|","|","|",null,"|","|","|","|",null,"Watchdog, Temp-/Fan-monitoring;","CAD 2D/3D"]
[null,null,null,null,null,null,"|","|","|","|",null,"|","|","|","|"]
[null,null,null,null,null,null,"|","|","|","|",null,"|","|","|","|",null,"Processor and Power Supply"]
[null,null,null,null,{"$f":"IF(AND(OR($G$5=\"A\"),$N$5<\"X\"),1,0)","v":0},"\"This configuration is not possible, please select 400W DC power supply instead\"","A","|","|","|",null,"|","|","|","|",null,"Pentium G7400E, 65W; 2C(2P+0E)4T, 3.6 GHz; with 9-36VDC, 220W power supply",null,{"$f":"IF($P$6=1,1,\"\")","v":1}]
[null,null,null,null,{"$f":"IF(AND(OR($G$5=\"B\"),$N$5<\"X\"),1,0)","v":0},"\"This configuration is not possible, please select 400W DC power supply instead\"","B","|","|","|",null,"|","|","|","|",null,"Core i3-13100TE, 35W; 35W; 4C (4P+0E)8T, 2.4(4.1) GHz;  with 9-36VDC, 220W power supply",null,{"$f":"IF($P$6=2,1,\"\")","v":""}]
[null,null,null,null,{"$f":"IF(AND(OR($G$5=\"C\"),$N$5<\"X\"),1,0)","v":0},"\"This configuration is not possible, please select 400W DC power supply instead\"","C","|","|","|",null,"|","|","|","|",null,"Core i5-13500E,  65W; with 65W; 14C(6P+8E)/20T, 2.4(4.6);  with 9-36VDC, 220W power supply",null,{"$f":"IF($P$6=3,1,\"\")","v":""}]
[null,null,null,null,null,null,"D","|","|","|",null,"|","|","|","|",null,"Pentium G7400E.65W; 2C(2P+0E)4T, 3.6 GHz; with 24VDC, 400W power supply",null,{"$f":"IF($P$6=4,1,\"\")","v":""}]
[null,null,null,null,null,null,"E","|","|","|",null,"|","|","|","|",null,"Core i3-13100TE, 35W; 4C (4P+0E)8T, 2.4(4.1) GHz; with 24VDC, 400W power supply",null,{"$f":"IF($P$6=5,1,\"\")","v":""}]
[null,null,null,null,null,null,"F","|","|","|",null,"|","|","|","|",null,"Core i5-13500E, 65W; 14C(6P+8E)/20T, 2.4(4.6) GHz; with 24VDC, 400W DC power supply",null,{"$f":"IF($P$6=6,1,\"\")","v":""}]
[null,null,null,null,null,null,"N","|","|","|",null,"|","|","|","|",null,"Core i3-13100TE, 35W; 4C (4P+0E)8T,  2.4(4.1) GHz;  with 9-36V DC, 220W power supply (fanless)",null,{"$f":"IF($P$6=7,1,\"\")","v":""}]
[null,null,null,null,null,null,"P","|","|","|",null,"|","|","|","|",null,"Core i3-13100TE, 35W; 4C (4P+0E)8T,  2.4(4.1) GHz; with 24VDC, 400W power supply (fanless)",null,{"$f":"IF($P$6=8,1,\"\")","v":""}]
[null,null,null,null,null,null,"X","|","|","|",null,"|","|","|","|",null,"No Base Module, no CPU; No power supply in base module",null,{"$f":"IF($P$6=9,1,\"\")","v":""}]
[null,null,null,null,null,null,null,"|","|","|",null,"|","|","|","|"]
[null,null,null,null,null,null," ","|","|","|",null,"|","|","|","|",null,"Drives"]
["NEW",null,null,null,{"$f":"IF(AND(OR($M$5>\"B\"),$H$5=\"A\"),1,0)","v":0},"\"Operating System requires a Mass Storage\"; ",null,"A","|","|",null,"|","|","|","|",null,"Base module without driver",null,{"$f":"IF($P$7=1,1,\"\")","v":1}]
[null,null,null,null,{"$f":"IF(AND(OR($G$5>\"W\"),$H$5=\"B\"),1,0)","v":0},"This configuration has no Base Module, thus no drives can be selected",null,"B","|","|",null,"|","|","|","|",null,"512 GB 2.5'' SATA SSD ",null,{"$f":"IF($P$7=2,1,\"\")","v":""}]
[null,null,null,null,{"$f":"IF(AND(OR($G$5>\"W\"),$H$5=\"C\"),1,0)","v":0},"This configuration has no Base Module, thus no drives can be selected",null,"C","|","|",null,"|","|","|","|",null,"1TB 2.5'' SATA SSD",null,{"$f":"IF($P$7=3,1,\"\")","v":""}]
[null,null,null,null,null,null,null,"X","|","|",null,"|","|","|","|",null,"No Base Module, no Drives",null,{"$f":"IF($P$7=4,1,\"\")","v":""}]
[null,null,null,null,null,null,null,null,"|","|",null,"|","|","|","|",null," "]
[null,null,null,null,null,null,null,null,"|","|",null,"|","|","|","|",null,"RAM"]
[null,null,null,null,{"$f":"IF(AND(OR($G$5>\"W\"),$I$5=0),1,0)","v":0},"This configuration has no Base Module, thus no RAM can be selected",null,null,0,"|",null,"|","|","|","|",null,"8 GB DDR5(1*8)",null,{"$f":"IF($P$8=1,1,\"\")","v":1}]
[null,null,null,null,{"$f":"IF(AND(OR($G$5>\"W\"),$I$5=2),1,0)","v":0},"This configuration has no Base Module, thus no RAM can be selected",null,null,2,"|",null,"|","|","|","|",null,"16 GB DDR5(1*16)",null,{"$f":"IF($P$8=2,1,\"\")","v":""}]
[null,null,null,null,{"$f":"IF(AND(OR($G$5>\"W\"),$I$5=4),1,0)","v":0},"This configuration has no Base Module, thus no RAM can be selected",null,null,4,"|",null,"|","|","|","|",null,"32 GB DDR5(1*32)",null,{"$f":"IF($P$8=3,1,\"\")","v":""}]
[null,null,null,null,{"$f":"IF(AND(OR($G$5>\"W\"),$I$5=6),1,0)","v":0},"This configuration has no Base Module, thus no RAM can be selected",null,null,6,"|",null,"|","|","|","|",null,"64 GB DDR5(2*32)",null,{"$f":"IF($P$8=4,1,\"\")","v":""}]
[null,null,null,null,null,null,null,null,8,"|",null,"|","|","|","|",null,"No Base Module, no RAM",null,{"$f":"IF($P$8=5,1,\"\")","v":""}]
[null,null,null,null,null,null,null,null,null,"|",null,"|","|","|","|"]
[null,null,null,null,null,null,null,null,null,"|",null,"|","|","|","|",null,"Hardware-Extension (flex module) "]
[null,null,null,null,null,null,null,null,null,{"$f":"IF($P$10<8,\"0\",\"#\")","v":"0"},null,"|","|","|","|",null,"without hardware extension",null,{"$f":"IF($P$9=1,1,\"\")","v":1}]
[null,null,null,null,{"$f":"IF(AND(OR($G$5>\"W\"),$J$5=1),1,0)","v":0},"This configuration has no Base Module, thus no NVRAM can be selected",null,null,null,1,null,"|","|","|","|",null,"NVRAM (M.2)",null,{"$f":"IF($P$9=2,1,\"\")","v":""}]
[null,null,null,null,null,null,null,null,null,null,null,"|","|","|","|"]
[null,null,null,null,null,null,null,null,null,null,null,"|","|","|","|",null,"Power cord"]
[null,null,null,null,{"$f":"IF(AND(OR($G$5>\"E\"),$L$5=0),1,0)","v":0},"\"Wrong Windows 10 LTSB 2016 for Core-i7\"; ",null,null,null,null,null,0,"|","|","|",null,"No power cord",null,{"$f":"IF($P$10=1,1,\"\")","v":1}]
[null,null,null,null,null,null,null,null,null,null,null,null,"|","|","|"]
[null,null,null,null,null,null," ",null,null,null,null,null,"|","|","|",null,"Operating System (pre-installed and activated)"]
[null,null,null,null,null,null,null,null,null,null," ",null,"A","|","|",null,"BM without operating system (without USB-Stick D&D)",null,{"$f":"IF($P$11=1,1,\"\")","v":1}]
[null,null,null,null,null,null,null,null,null,null,null,null,"B","|","|",null,"BM without operating system (with USB-stick D&D)",null,{"$f":"IF($P$11=2,1,\"\")","v":""}]
[null,null,null,null,null,null,null,null,null,null," ",null,"C","|","|",null,"Windows 10 IoT Enterprise LTSC 2021, 64 bit, MUI, for Pentium Core i3, Core i5 (without USB-Stick Restore-Image; D&D)",null,{"$f":"IF($P$11=3,1,\"\")","v":""}]
[null,null,null,null,null,null,null,null,null,null,null,null,"D","|","|",null,"Windows 10 IoT Enterprise LTSC 2021, 64 bit, MUI, for Pentium, Core i3, Core i5  (with USB-stick Restore-Image; D&D)",null,{"$f":"IF($P$11=4,1,\"\")","v":""}]
[null,null,null,null,{"$f":"IF(AND(OR($G$5=\"X\"),$M$5<\"X\"),1,0)","v":0},"Because no BM is selected, no software can be installed",null,null,null,null,null,null,"X","|","|",null,"no Base Module, no Software",null,{"$f":"IF($P$11=5,1,\"\")","v":""}]
[null,null,null,null,null,null,null,null,null,null,null,null,null,"|","|"]
[null,null,null,null,null,null,null,null,null,null,null,null,null,"|","|",null,"Expansion Module"]
[null,null,null,null,null,null,null,null,null,null,null,null,null,"B","|",null,"EM2: PCIe x 16 gen4 and  PCIe x 4",null,{"$f":"IF($P$12=1,1,\"\")","v":""}]
[null,null,null,null,{"$f":"IF(AND(($N$5=\"X\"),OR($G$5=\"X\")),1,0)","v":0},"\"This configuration is not available\""," "," "," "," "," "," "," ","X","|",null,"No Extension Module",null,{"$f":"IF($P$12=2,1,\"\")","v":1}]
[null,null,null,null,null,null," "," "," "," "," "," "," "," ","|"," "]
[null,null,null,null,null,null," "," "," "," "," "," "," ",null,"|",null,"Mass Storage in Extension Module"]
[null,null,null,null,{"$f":"IF(AND(($O$5=0),OR($N$5=\"X\")),1,0)","v":0},"Select no EM, no EM storage",null,null,null,null,null,null,null,null,0,null,"EM without storage",null,{"$f":"IF($P$13=1,1,\"\")","v":""}]
[null,null,null,null,{"$f":"IF(AND(($O$5=7),OR($N$5=\"B\")),1,0)","v":0},"Select EM without storage",null,null,null,null,null,null,null,null,7,null,"No Extension Module, no EM storage",null,{"$f":"IF($P$13=2,1,\"\")","v":1}]
[]
[null,null,null,null,null,null,null,null,null,null,null,null,null,null,null,null,null,null,{"$f":"IF(AND((S30=1),(S36=1),(S43=1)),0,1)","v":1}]
[null,null,null,null,null,null,null,null,null,null,null,null,null,null,null,null,null,null,{"$f":"IF(S67=0,1,0)","v":0}]
[]
[{"$f":"A$5","v":"6AG4"},1,3,2,"-",0,{"$f":"G5","v":"A"},{"$f":"H5","v":"A"},{"$f":"I5","v":0},{"$f":"J5","v":"0"},"-",{"$f":"L5","v":0},{"$f":"M5","v":"A"},{"$f":"N5","v":"X"},{"$f":"O5","v":7},null,null,"Total:",1]
[]
[]
["Accessories:"]

{"sheet":"IPC BX-59A","index":19,"n_rows":88,"n_cols":19,"rows_kept":88,"cut":false,"hidden":false,"merged":[[0,17,3,17]]}
["SIMATIC IPC BX-59A (BoxPC)",null,null,null,null,null,null,null,null,null,null,null,null,null,null,null,{"$f":"$A$5&$B$5&$C$5&$D$5&$E$5&$F$5&$G$5&$H$5&$I$5&$J$5&$K$5&$L$5&$M$5&$N$5&$O$5","v":"6AG4133-0AA00-0AB0"}]
[null,null,null,null,null,null,null,null,null,null,null,null,null,null,null,null,{"$f":"IF(E27,F27,\"\")&IF(E28,F28,\"\")&IF(E32,F32,\"\")&IF(E29,F29,\"\")&IF(E30,F30,\"\"&IF(E31,F31,\"\")&IF(E32,F32,\"\")&IF(E33,F33,\"\")&IF(E36,F36,\"\")&IF(E37,F37,\"\")&IF(E38,F38,\"\")&IF(E43,F43,\"\")&IF(E44,F44,\"\")&IF(E39,F39,\"\"&IF(E40,F40,\"\")&IF(E41,F41,\"\")&IF(E42,F42,\"\"))&IF(E45,F45,\"\")&IF(E59,F59,\"\")&IF(E48,F48,\"\")&IF(E49,F49,\"\")&IF(E50,F50,\"\")&IF(E51,F51,\"\")&IF(E52,F52,\"\")&IF(E53,F53,\"\")&IF(E54,F54,\"\")&IF(E67,F67,\"\"&IF(E68,F68,\"\")&IF(E69,F69,\"\")&IF(E70,F70,\"\")&IF(E71,F71,\"\")&IF(E72,F72,\"\")&IF(E77,F77,\"\")&IF(E81,F81,\"\")&IF(E80,F80,\"\")))","v":""}]
[null,null,{"$f":"IF(OR(F5=\"#\",G5=\"#\",H5=\"#\",I5=\"#\",J5=\"#\",L5=\"#\",M5=\"#\",N5=\"#\",P5=\"#\",O5=\"#\"),1,0)","v":0},"Configuration not possible. Mind the combinations of the options"]
[" ",null,null,null,null,null,null,null,null,null,null,null,null,null,null,null," "]
["6AG4",1,3,3,"-",0,{"$f":"INDEX(G23:G33,P6)","v":"A"},{"$f":"INDEX(H36:H45,P7)","v":"A"},{"$f":"INDEX(I48:I55,P8)","v":0},{"$f":"INDEX(J58:J59,P9)","v":"0"},"-",{"$f":"INDEX(L62:L62,P10)","v":0},{"$f":"INDEX(M65:M72,P11)","v":"A"},{"$f":"INDEX(N75:N77,P12)","v":"B"},{"$f":"INDEX(O80:O81,P13)","v":0},null,{"$f":" \"SIMATIC IPC BX-59A\" & \" (Modular Box PC)\"","v":"SIMATIC IPC BX-59A (Modular Box PC)"},{"$f":"A5&B5&C5&D5&E5&F5&G5&H5&I5&J5&K5&L5&M5&N5&O5","v":"6AG4133-0AA00-0AB0"}]
[null,null,null,null,null,null,"|","|","|","|",null,"|","|","|","|",1,{"$f":"INDEX(Q23:Q33,P6)","v":"Core i5-13500E, 65W; 14C(6P+8E)/20T; 2.4(4.6) GHz; with 24VDC, 400W power supply"}]
[null,null,null,null,null,null,"|","|","|","|",null,"|","|","|","|",1,{"$f":"INDEX(Q36:Q45,P7)","v":"Base module without driver"}," "]
[null,null,null,null,null,null,"|","|","|","|",null,"|","|","|","|",1,{"$f":"INDEX(Q48:Q55,P8)","v":"8 GB DDR5(1*8)"}]
[null,null,null,null,null,null,"|","|","|","|",null,"|","|","|","|",1,{"$f":"INDEX(Q58:Q59,P9)","v":"without hardware extension (M.2)"}]
[null,null,null,null,null,null,"|","|","|","|",null,"|","|","|","|",1,{"$f":"INDEX(Q62:Q62,P10)","v":"No power cord"}]
[null,null,null,null,null,null,"|","|","|","|",null,"|","|","|","|",1,{"$f":"INDEX(Q65:Q72,P11)","v":"BM without operating system (without USB-Stick D&D)"}]
[null,null,null,null,null,null,"|","|","|","|",null,"|","|","|","|",1,{"$f":"INDEX(Q75:Q77,P12)","v":"EM2: PCIe x 16 gen4 and  PCIe x 4 gen4"}]
[null,null,null,null,null,null,"|","|","|","|",null,"|","|","|","|",1,{"$f":"INDEX(Q80:Q81,P13)","v":"EM without storage"}]
[null,null,null,null,null,null,"|","|","|","|",null,"|","|","|","|",1,"Mainboard (Chipset R680E);"]
[null,null,null,null,null,null,"|","|","|","|",null,"|","|","|","|",null,"2x DP; Audio; 2x SIM slots;"]
[null,null,null,null,null,null,"|","|","|","|",null,"|","|","|","|",null,"4x Gigabit Ethernet (IE/PN) RJ45;","Link utili"]
[null,null,null,null,null,null,"|","|","|","|",null,"|","|","|","|",null,"6x USB 3.1 Gen.2; 1x USB-C, 2x seriell (COM);","Certificati"]
[null,null,null,null,null,null,"|","|","|","|",null,"|","|","|","|",null,"2x M.2 flex modules slots onboard;","Datasheet"]
[null,null,null,null,null,null,"|","|","|","|",null,"|","|","|","|",null,"RAID-Controller onboard;","Manuale"]
[null,null,null,null,null,null,"|","|","|","|",null,"|","|","|","|",null,"Watchdog, Temp-/Fan-monitoring;","CAD 2D/3D"]
[null,null,null,null,null,null,"|","|","|","|",null,"|","|","|","|"]
[null,null,null,null,null,null,"|","|","|","|",null,"|","|","|","|",null,"Base module configuration with Processor and Power Supply"]
[null,null,null,null,null,null,"A","|","|","|",null,"|","|","|","|",null,"Core i5-13500E, 65W; 14C(6P+8E)/20T; 2.4(4.6) GHz; with 24VDC, 400W power supply",null,{"$f":"IF($P$6=1,1,\"\")","v":1}]
[null,null,null,null,null,null,"B","|","|","|",null,"|","|","|","|",null,"Core i7-13700TE, 35W; 16C(8P+8E)/24T, 1.1(4.8) GHz; with 24VDC, 400W power supply",null,{"$f":"IF($P$6=2,1,\"\")","v":""}]
[null,null,null,null,null,null,"C","|","|","|",null,"|","|","|","|",null,"Core i7-13700E, 65W; 16C(8P+8E)/24T, 1.9(5.1) GHz; with 24VDC, 400W power supply",null,{"$f":"IF($P$6=3,1,\"\")","v":""}]
[null,null,null,null,null,null,"D","|","|","|",null,"|","|","|","|",null,"Core i9-13900E, 65W;  24C(8P+16E)/32T, 1.8(5.2) GHz; with 24VDC, 400W power supply",null,{"$f":"IF($P$6=4,1,\"\")","v":""}]
[null,null,null,null,{"$f":"IF(AND(OR($G$5=\"E\"),$N$5<\"X\"),1,0)","v":0},"\"This configuration is not possible, please select 400W DC power supply instead\"","E","|","|","|",null,"|","|","|","|",null,"Core i5-13500E, 65W;  14C(6P+8E)/20T; 2.4(4.6) GHz; with 9-36VDC, 220W power supply",null,{"$f":"IF($P$6=5,1,\"\")","v":""}]
[null,null,null,null,{"$f":"IF(AND(OR($G$5=\"F\"),$N$5<\"X\"),1,0)","v":0},"\"This configuration is not possible, please select 400W DC power supply instead\"","F","|","|","|",null,"|","|","|","|",null,"Core i7-13700TE, 35W; 16C(8P+8E)/24T, 1.1(4.8) GHz; with 9-36VDC, 220W power supply",null,{"$f":"IF($P$6=6,1,\"\")","v":""}]
[null,null,null,null,{"$f":"IF(AND(OR($G$5=\"G\"),$N$5<\"X\"),1,0)","v":0},"\"This configuration is not possible, please select 400W DC power supply instead\"","G","|","|","|",null,"|","|","|","|",null,"Core i7-13700E, 65W; 16C(8P+8E)/24T,  1.9(5.1) GHz; with 9-36VDC, 220W power supply",null,{"$f":"IF($P$6=7,1,\"\")","v":""}]
[null,null,null,null,{"$f":"IF(AND(OR($G$5=\"H\"),$N$5<\"X\"),1,0)","v":0},"\"This configuration is not possible, please select 400W DC power supply instead\"","H","|","|","|",null,"|","|","|","|",null,"Core i9-13900E, 65W; 24C(8P+16E)/32T, 1.8(5.2) GHz; with 9-36VDC, 220W power supply",null,{"$f":"IF($P$6=8,1,\"\")","v":""}]
[null,null,null,null,{"$f":"IF(AND(($G$5=\"N\"),OR($N$5=\"A\",$N$5=\"B\",$N$5=\"N\")),1,0)","v":0},"\"This configuration is not possible without fan, please select a configuration with fan module instead\"","N","|","|","|",null,"|","|","|","|",null,"Core i7-13700TE, 35W; 16C(8P+8E)/24T, 1.1(4.8) GHz; with 24VDC, 400W power supply (fanless)",null,{"$f":"IF($P$6=9,1,\"\")","v":""}]
[null,null,null,null,{"$f":"IF(AND(($G$5=\"P\"),OR($N$5=\"A\",$N$5=\"B\",$N$5=\"N\")),1,0)","v":0},"\"This configuration is not possible without fan, please select a configuration with fan module instead\"","P","|","|","|",null,"|","|","|","|",null,"Core i7-13700TE, 35W; 16C(8P+8E)/24T, 1.1(4.8) GHz; with 9-36VDC, 220W power supply (fanless)",null,{"$f":"IF($P$6=10,1,\"\")","v":""}]
[null,null,null,null,{"$f":"IF(AND(OR($G$5=\"X\"),$I$5<8),1,0)","v":0},"Please select No BM, no RAM","X","|","|","|",null,"|","|","|","|",null,"No Base Module, no CPU, No power supply in Base Module",null,{"$f":"IF($P$6=11,1,\"\")","v":""}]
[null,null,null,null,null,null,null,"|","|","|",null,"|","|","|","|"]
[null,null,null,null,null,null," ","|","|","|",null,"|","|","|","|",null,"Drives in Base Module"]
["NEW",null,null,null,{"$f":"IF(AND(OR($M$5>\"B\"),$H$5=\"A\"),1,0)","v":0},"\"Operating System requires a Mass Storage\"; ",null,"A","|","|",null,"|","|","|","|",null,"Base module without driver",null,{"$f":"IF($P$7=1,1,\"\")","v":1}]
[null,null,null,null,{"$f":"IF(AND(OR($G$5>\"W\"),$H$5=\"B\"),1,0)","v":0},"This configuration has no Base Module, thus no drives can be selected",null,"B","|","|",null,"|","|","|","|",null,"512 GB 2.5'' SATA SSD ",null,{"$f":"IF($P$7=2,1,\"\")","v":""}]
[null,null,null,null,{"$f":"IF(AND(OR($G$5>\"W\"),$H$5=\"C\"),1,0)","v":0},"This configuration has no Base Module, thus no drives can be selected",null,"C","|","|",null,"|","|","|","|",null,"1TB 2.5'' SATA SSD",null,{"$f":"IF($P$7=3,1,\"\")","v":""}]
[null,null,null,null,{"$f":"IF(AND(OR($G$5>\"W\"),$H$5=\"D\"),1,0)","v":0},"This configuration has no Base Module, thus no drives can be selected",null,"D","|","|",null,"|","|","|","|",null,"512 GB M.2 NVME onboard SSD",null,{"$f":"IF($P$7=4,1,\"\")","v":""}]
[null,null,null,null,{"$f":"IF(AND(OR($G$5>\"W\"),$H$5=\"E\"),1,0)","v":0},"This configuration has no Base Module, thus no drives can be selected",null,"E","|","|",null,"|","|","|","|",null,"1 TB M.2 NVME onboard SSD",null,{"$f":"IF($P$7=5,1,\"\")","v":""}]
[null,null,null,null,{"$f":"IF(AND(OR($G$5>\"W\"),$H$5=\"F\"),1,0)","v":0},"This configuration has no Base Module, thus no drives can be selected",null,"F","|","|",null,"|","|","|","|",null,"512 GB M.2 NVME onboard SSD with 1*512 GB M.2 NVME on 1 exchangeable SSD slider",null,{"$f":"IF($P$7=6,1,\"\")","v":""}]
[null,null,null,null,{"$f":"IF(AND(OR($G$5>\"W\"),$H$5=\"G\"),1,0)","v":0},"This configuration has no Base Module, thus no drives can be selected",null,"G","|","|",null,"|","|","|","|",null,"512 GB M.2 NVME onboard SSD with 1*1TB M.2 NVME on 1 exchangeable SSD slider",null,{"$f":"IF($P$7=7,1,\"\")","v":""}]
[null,null,null,null,{"$f":"IF(AND(OR($G$5>\"W\"),$H$5=\"K\"),1,0)","v":0},"This configuration has no Base Module, thus no drives can be selected",null,"K","|","|",null,"|","|","|","|",null,"480 GB 2.5'' SATA SSD (PLP)",null,{"$f":"IF($P$7=8,1,\"\")","v":""}]
[null,null,null,null,{"$f":"IF(AND(OR($G$5>\"W\"),$H$5=\"L\"),1,0)","v":0},"This configuration has no Base Module, thus no drives can be selected",null,"L","|","|",null,"|","|","|","|",null,"960 GB 2.5'' SATA SSD (PLP)",null,{"$f":"IF($P$7=9,1,\"\")","v":""}]
[null,null,null,null,{"$f":"IF(AND(($H$5=\"X\"),OR($M$5=\"C\",$M$5=\"D\",$M$5=\"E\",,$M$5=\"F\",$M$5=\"G\")),1,0)","v":0},"Please select a configuration with drive, so that an operating system can be installed.",null,"X","|","|",null,"|","|","|","|",null,"No Base Module, no Driver",null,{"$f":"IF($P$7=10,1,\"\")","v":""}]
[null,null,null,null,null,null,null,null,"|","|",null,"|","|","|","|",null," "]
[null,null,null,null,null,null,null,null,"|","|",null,"|","|","|","|",null,"RAM"]
[null,null,null,null,{"$f":"IF(AND(OR($G$5>\"W\"),$I$5=0),1,0)","v":0},"This configuration has no Base Module, thus no RAM can be selected",null,null,0,"|",null,"|","|","|","|",null,"8 GB DDR5(1*8)",null,{"$f":"IF($P$8=1,1,\"\")","v":1}]
[null,null,null,null,{"$f":"IF(AND(OR($G$5>\"W\"),$I$5=1),1,0)","v":0},"This configuration has no Base Module, thus no RAM can be selected",null,null,1,"|",null,"|","|","|","|",null,"16 GB DDR5(1*16) ECC",null,{"$f":"IF($P$8=2,1,\"\")","v":""}]
[null,null,null,null,{"$f":"IF(AND(OR($G$5>\"W\"),$I$5=2),1,0)","v":0},"This configuration has no Base Module, thus no RAM can be selected",null,null,2,"|",null,"|","|","|","|",null,"16 GB DDR5(1*16)",null,{"$f":"IF($P$8=3,1,\"\")","v":""}]
[null,null,null,null,{"$f":"IF(AND(OR($G$5>\"W\"),$I$5=3),1,0)","v":0},"This configuration has no Base Module, thus no RAM can be selected",null,null,3,"|",null,"|","|","|","|",null,"32 GB DDR5(1*32) ECC",null,{"$f":"IF($P$8=4,1,\"\")","v":""}]
[null,null,null,null,{"$f":"IF(AND(OR($G$5>\"W\"),$I$5=4),1,0)","v":0},"This configuration has no Base Module, thus no RAM can be selected",null,null,4,"|",null,"|","|","|","|",null,"32 GB DDR5(1*32)",null,{"$f":"IF($P$8=5,1,\"\")","v":""}]
[null,null,null,null,{"$f":"IF(AND(OR($G$5>\"W\"),$I$5=5),1,0)","v":0},"This configuration has no Base Module, thus no RAM can be selected",null,null,5,"|",null,"|","|","|","|",null,"64 GB DDR5(2*32) ECC",null,{"$f":"IF($P$8=6,1,\"\")","v":""}]
[null,null,null,null,{"$f":"IF(AND(OR($G$5>\"W\"),$I$5=6),1,0)","v":0},"This configuration has no Base Module, thus no RAM can be selected",null,null,6,"|",null,"|","|","|","|",null,"64 GB DDR5(2*32)",null,{"$f":"IF($P$8=7,1,\"\")","v":""}]
[null,null,null,null,null,null,null,null,8,"|",null,"|","|","|","|",null,"No Base Module, no RAM",null,{"$f":"IF($P$8=8,1,\"\")","v":""}]
[null,null,null,null,null,null,null,null,null,"|",null,"|","|","|","|"]
[null,null,null,null,null,null,null,null,null,"|",null,"|","|","|","|",null,"Hardware-Extension (flex module) "]
[null,null,null,null,null,null,null,null,null,{"$f":"IF($P$10<8,\"0\",\"#\")","v":"0"},null,"|","|","|","|",null,"without hardware extension (M.2)",null,{"$f":"IF($P$9=1,1,\"\")","v":1}]
[null,null,null,null,{"$f":"IF(AND(OR($G$5>\"W\"),$J$5=1),1,0)","v":0},"This configuration has no Base Module, thus no NVRAM can be selected",null,null,null,1,null,"|","|","|","|",null,"NVRAM (M.2)",null,{"$f":"IF($P$9=2,1,\"\")","v":""}]
[null,null,null,null,null,null,null,null,null,null,null,"|","|","|","|"]
[null,null,null,null,null,null,null,null,null,null,null,"|","|","|","|",null,"Power cord"]
[null,null,null,null,null,null,null,null,null,null,null,0,"|","|","|",null,"No power cord",null,{"$f":"IF($P$10=1,1,\"\")","v":1}]
[null,null,null,null,null,null,null,null,null,null,null,null,"|","|","|"]
[null,null,null,null,null,null," ",null,null,null,null,null,"|","|","|",null,"Operating System (pre-installed and activated)"]
[null,null,null,null,null,null,null,null,null,null," ",null,"A","|","|",null,"BM without operating system (without USB-Stick D&D)",null,{"$f":"IF($P$11=1,1,\"\")","v":1}]
[null,null,null,null,null,null,null,null,null,null,null,null,"B","|","|",null,"BM without operating system (with USB-stick D&D)",null,{"$f":"IF($P$11=2,1,\"\")","v":""}]
[null,"NEW",null,null,{"$f":"IF(AND(($M$5=\"C\"),OR($G$5=\"B\",$G$5=\"C\",$G$5=\"D\",$G$5=\"F\",$G$5=\"G\",$G$5=\"H\",$G$5>\"J\")),1,0)","v":0},"\"Wrong operating system\"",null,null,null,null,null,null,"C","|","|",null,"Windows 10 IoT Enterprise LTSC 2021, 64 bit, MUI, for Core i5 (without USB-Stick Restore-Image; D&D)",null,{"$f":"IF($P$11=3,1,\"\")","v":""}]
[null,"NEW",null,null,{"$f":"IF(AND(($M$5=\"D\"),OR($G$5=\"B\",$G$5=\"C\",$G$5=\"D\",,$G$5=\"F\",,$G$5=\"G\",,$G$5=\"H\",$G$5>\"J\")),1,0)","v":0},"\"Wrong operating system\"",null,null,null,null,null,null,"D","|","|",null,"Windows 10 IoT Enterprise LTSC 2021, 64 bit, MUI for Core i5  (with USB-stick Restore-Image; D&D)",null,{"$f":"IF($P$11=4,1,\"\")","v":""}]
[null,"NEW",null,null,{"$f":"IF(AND(($M$5=\"E\"),OR($G$5=\"A\",$G$5=\"E\",$G$5=\"J\")),1,0)","v":0},"\"Wrong operating system\"",null,null,null,null," ",null,"E","|","|",null,"Windows 10 IoT Enterprise LTSC 2021, 64 bit, MUI, for Core i7, for Core i9 (without USB-Stick Restore-Image; D&D)",null,{"$f":"IF($P$11=5,1,\"\")","v":""}]
[null,"NEW",null,null,{"$f":"IF(AND(($M$5=\"F\"),OR($G$5=\"A\",$G$5=\"E\",$G$5=\"J\")),1,0)","v":0},"\"Wrong operating system\"",null,null,null,null,null,null,"F","|","|",null,"Windows 10 IoT Enterprise LTSC 2021, 64 bit, MUI, for Core i7, for Core i9  (with USB-stick Restore-Image; D&D)",null,{"$f":"IF($P$11=6,1,\"\")","v":""}]
[null,null,null,null,{"$f":"IF(AND(($M$5=\"#\"),OR($M$5<\"F\")),1,0)","v":0},"This configuration is not available",null,null,null,null,null,null,{"$f":"IF(AND($P$6=4,$P$7=5,$P$8=5,$P$9=1,$P$10=1,$P$12=2,$P$13=1),\"W\",\"#\")","v":"#"},"|","|",null,"Industrial Edge -SIMATIC",null,{"$f":"IF($P$11=7,1,\"\")","v":""}]
[null,null,null,null,{"$f":"IF(AND(OR($G$5=\"X\"),$M$5<\"X\"),1,0)","v":0},"Because no BM is selected, no software can be installed",null,null,null,null,null,null,"X","|","|",null,"No Base Module, no software",null,{"$f":"IF($P$11=8,1,\"\")","v":""}]
[null,null,null,null,null,null,null,null,null,null,null,null,null,"|","|"]
[null,null,null,null,null,null,null,null,null,null,null,null,null,"|","|",null,"Expansion Module"]
[null,null,null,null,null,null,null,null,null,null,null,null,null,"B","|",null,"EM2: PCIe x 16 gen4 and  PCIe x 4 gen4",null,{"$f":"IF($P$12=1,1,\"\")","v":1}]
[null,null,null,null,null,null,null,null,null,null,null,null,null,"N","|",null,"EM2: PCIe x 16 + graphic card NVIDIA L4 and PCIe x 4 + 1 dual-port 10GB fiber card; with 1 SFP+ Transceiver",null,{"$f":"IF($P$12=2,1,\"\")","v":""}]
[null,null,null,null,{"$f":"IF(AND(($N$5=\"X\"),OR($G$5=\"X\")),1,0)","v":0},"\"This configuration is not available\""," "," "," "," "," "," "," ","X","|",null,"No Extension Module",null,{"$f":"IF($P$12=3,1,\"\")","v":""}]
[null,null,null,null,null,null," "," "," "," "," "," "," "," ","|"," "]
[null,null,null,null,null,null," "," "," "," "," "," "," ",null,"|",null,"Mass Storage in Extension Module"]
[null,null,null,null,{"$f":"IF(AND(($O$5=0),OR($N$5=\"X\")),1,0)","v":0},"\"Select no EM, no EM storage\"",null,null,null,null,null,null,null,null,0,null,"EM without storage",null,{"$f":"IF($P$13=1,1,\"\")","v":1}]
[null,null,null,null,{"$f":"IF(AND(($O$5=7),OR($N$5=\"B\",$N$5=\"N\")),1,0)","v":0},"Select EM without storage",null,null,null,null,null,null,null,null,7,null,"No Extension Module, no EM storage",null,{"$f":"IF($P$13=2,1,\"\")","v":""}]
[]
[null,null,null,null,null,null,null,null,null,null,null,null,null,null,null,null,null,null,{"$f":"IF(AND((S33=1),(S45=1),(S55=1)),0,1)","v":1}]
[null,null,null,null,null,null,null,null,null,null,null,null,null,null,null,null,null,null,{"$f":"IF(S83=0,1,0)","v":0}]
[]
[{"$f":"A$5","v":"6AG4"},1,3,3,"-",0,{"$f":"G5","v":"A"},{"$f":"H5","v":"A"},{"$f":"I5","v":0},{"$f":"J5","v":"0"},"-",{"$f":"L5","v":0},{"$f":"M5","v":"A"},{"$f":"N5","v":"B"},{"$f":"O5","v":0},null,null,"Total:",1]
[]
["Accessories:"]

{"sheet":"IPC BX-35A(Box)","index":20,"n_rows":36,"n_cols":21,"rows_kept":36,"cut":false,"hidden":false,"merged":[[0,17,4,17]]}
["SIMATIC IPC BX-35A (BoxPC)",null,null,null,null,null,null,null,null,null,null,null,null,null,null,null,{"$f":"$A$6&$B$6&$C$6&$D$6&$E$6&$F$6&$G$6&$H$6&$I$6&$J$6&$K$6&$L$6&$M$6&$N$6&$O$6","v":"6ES7647-0JC00-0YA2"},null,null,null,"."]
[null,null,null,null,null,null,null,null,null,null,null,null,null,null,null,null,"IPC Basato su Chipset Nvidia per AI Linux Based"]
[null,null,null,"Barebone not avaliable yet, please choice another option","Operating System is not avaliable without Hard Drive, please choice another option",null,null,null,null,null,null,null,null,null,null,null,{"$f":"$A$6&$B$6&$C$6&$D$6&$E$6&$F$6&$G$6&$H$6&$I$6&$J$6&$K$6&$L$6&$M$6&$N$6&$O$6","v":"6ES7647-0JC00-0YA2"}]
[null,null,{"$f":"IF(OR(I6=\"#\",J6=\"#\",N6=\"#\"),1,0)","v":0},"Barebone not avaliable yet, please choice another option","OS not avaliable yet, please choice another option",null,null,null,null,null,null,null,null,null,null,null,{"$f":"IF(P8=1,D3,\"\")&IF(AND(P9=1,P12=2),E3,\"\")","v":"Barebone not avaliable yet, please choice another option"}]
[" ",null,null,null,null,null,null,null,null,null,null,null,null,null,null,null," "]
["6ES7",6,4,7,"-",0,"J","C",{"$f":"VLOOKUP(P8,A19:Q21,9,TRUE)","v":0},{"$f":"VLOOKUP(P9,A24:Q27,10,TRUE)","v":"0"},"-",0,"Y",{"$f":"VLOOKUP(P12,A30:Q31,14,TRUE)","v":"A"},2,null,{"$f":" \"SIMATIC IPC BX-35A\" & \" (Box PC)\"","v":"SIMATIC IPC BX-35A (Box PC)"},{"$f":"T(Q3)","v":"6ES7647-0JC00-0YA2"}]
[null,null,null,"|",null,null,null,null,"|","|",null,null,null,"|",null,1,{"$f":"VLOOKUP(P7,A16:Q16,17,FALSE)","v":"Standard Device"}]
[null,null,null,"|",null,null,null,null,"|","|",null,null,null,"|",null,1,{"$f":"VLOOKUP(P8,A19:Q21,17,FALSE)","v":"No SOM"}]
[null,null,null,"|",null,null,null,null,"|","|",null,null,null,"|",null,1,{"$f":"VLOOKUP(P9,A24:Q27,17,FALSE)","v":"Without mass storage"},"Link utili"]
[null,null,null,"|",null,null,null,null,"|","|",null,null,null,"|",null,1,"4x Gbe RJ45 with PoE, 3x USB 3.1 TypeA, 1x USB 2.0 Micro USB, 1x DP1.4","Certificati"]
[null,null,null,"|",null,null,null,null,"|","|",null,null,null,"|",null,9,"1x RS232/RS422/RS485, 4x DI 4x DO, 1x CAN FD"]
[null,null,null,"|",null,null,null,null,"|","|",null,null,null,"|",null,1,"Without Operating system","Manuale"]
[null,null,null,"|",null,null,null,null,"|","|",null,null,null,"|",null,1,"3x M.2 extension slot","CAD 2D/3D"]
[null,null,null,"|",null,null,null,null,"|","|",null,null,null,"|",null,null," "]
[null,null,null,"|",null,null,null,null,"|","|",null,null,null,"|",null,null,"Device"]
[1,null,null,7,null,null,null,null,"|","|",null,null,null,"|",null,null,"Standard Device",null,{"$f":"IF($P$7=1,1,\"\")","v":1}]
[null,null,null,null,null,null,null,null,"|","|",null,null,null,"|"]
[null,null,null,null,null,null,null,null,"|","|",null,null,null,"|",null,null,"SOM"]
[1,null,null,null,null,null,null,null,0,"|",null,null,null,"|",null,null,"No SOM",null,{"$f":"IF($P$8=1,1,\"\")","v":1}]
[2," ",null,null," ",null,null,null,1,"|",null,null,null,"|",null,null,"Orin NX 8GB 50Tops(int8 s)",null,{"$f":"IF($P$8=2,1,\"\")","v":""}]
[3,null,null,null," ",null,null,null,2,"|",null,null,null,"|",null,null,"Orin NX 16GB 100Tops(int8 s)",null,{"$f":"IF($P$8=3,1,\"\")","v":""}]
[null,null,null,null,null,null,null,null,null,"|",null,null,null,"|"]
[null,null,null,null,null,null,null,null,null,"|",null,null,null,"|",null,null,"Mass storage"]
[1,null,null,null,null,null,null,null,null,{"$f":"IF($P$8<8,\"0\",\"#\")","v":"0"},null,null,null,"|",null,null,"Without mass storage",null,{"$f":"IF($P$9=1,1,\"\")","v":1}]
[2,null,null,null,null,null,null,null,null,{"$f":"IF(P8=1,\"#\",1)","v":"#"},null,null,null,"|",null,null,"256GB M.2 SSD",null,{"$f":"IF($P$9=2,1,\"\")","v":""}]
[3,null,{"$f":"IF(OR($P$11<3,$P$11=1,$P$11=2,$P$11=8,$P$11=9,$P$11=12)*OR($P$10<3,$P$10>5),1,0)","v":1},null,null,null,null,null,null,{"$f":"IF(P8=1,\"#\",2)","v":"#"},null,null,null,"|",null,null,"512GB M.2 SSD",null,{"$f":"IF($P$9=3,1,\"\")","v":""}]
[4,null,null,null,null,null,null,null,null,{"$f":"IF(P8=1,\"#\",3)","v":"#"},null,null,null,"|",null,null,"1TB M.2 SSD",null,{"$f":"IF($P$9=4,1,\"\")","v":""}]
[" ",null,null,null,null,null,null,null,null,null,null,null,null,"|"]
[null,null,null,null,null,null,null,null,null,null,null,null,null,"|",null,null,"Operating System"]
[1,null,null,null,null,null," "," "," "," "," "," "," ","A",null,null,"Without Operating system",null,{"$f":"IF($P$12=1,1,\"\")","v":1}]
[2,null,null,null,null,null,null,null,null,null,null,null,null,{"$f":"IF(P9=1,\"#\",\"B\")","v":"#"},null,null,"SIMATIC Industrial OS V3.4",null,{"$f":"IF($P$12=2,1,\"\")","v":""}]
[null,null,null,null,null,null," "," "," "," "," "," "," "," ",null," "]
[]
[null,null,null,null,null,null,null,null,null,null,null,null,null,null,null,null,"Base version",null,1]
[]
[null,null,null,null,null,null,null,null,null,null,null,null,null,null,null,null,{"$f":"Q4","v":"Barebone not avaliable yet, please choice another option"},"Total:"]

{"sheet":"IPC627E (Box)","index":21,"n_rows":105,"n_cols":19,"rows_kept":105,"cut":false,"hidden":false,"merged":[]}
["SIMATIC IPC627E"]
[null,null,null,null,null,null,null,null,null,null,null,null,null,null,null,null,{"$f":"IF(E41,F41,\"\")&IF(E59,F59,\"\")&IF(E60,F60,\"\")&IF(E61,F61,\"\")&IF(E62,F62,\"\")&IF(E29,F29,\"\")&IF(E36,F36,\"\")&IF(E76,F76,\"\")&IF(E83,F83,\"\")&IF(E84,F84,\"\")&IF(E63,F63,\"\")&IF(E64,F64,\"\")","v":""}]
[]
[]
["6AG4",1,3,1,"-",3,{"$f":"INDEX(G21:G26,P6)","v":"A"},{"$f":"INDEX(H29:H41,P7)","v":"A"},{"$f":"INDEX(I44:I48,P8)","v":0},{"$f":"INDEX(J51:J56,P9)","v":0},"-",{"$f":"INDEX(L59:L65,P10)","v":8},{"$f":"INDEX(M68:M72,P11)","v":"A"},{"$f":"INDEX(N75:N77,P12)","v":"A"},{"$f":"INDEX(O80:O87,P13)","v":2},null,"SIMATIC IPC627E (Box PC)",{"$f":"A5&B5&C5&D5&E5&F5&G5&H5&I5&J5&K5&L5&M5&N5&O5","v":"6AG4131-3AA00-8AA2"}]
[null,null,null,null,null,null,"|","|","|","|",null,"|","|","|","|",1,{"$f":"INDEX(Q21:Q26,P6)","v":"Celeron G4900 (2C/2T, 3.1GHz, 2MB Cache; VT-d);"}]
[null,null,null,null,null,null,"|","|","|","|",null,"|","|","|","|",1,{"$f":"INDEX(Q29:Q41,P7)","v":"HDD 2.5\" SATA 320 GB internal;"}]
[null,null,null,null,null,null,"|","|","|","|",null,"|","|","|","|",1,{"$f":"INDEX(Q44:Q48,P8)","v":"4 GB DDR4-2666 (1x4);"}]
[null,null,null,null,null,null,"|","|","|","|",null,"|","|","|","|",1,{"$f":"INDEX(Q51:Q56,P9)","v":"DC 24V industrial power supply;"}]
[null,null,null,null,null,null,"|","|","|","|",null,"|","|","|","|",7,{"$f":"INDEX(Q59:Q65,P10)","v":"Without operating system;"}]
[null,null,null,null,null,null,"|","|","|","|",null,"|","|","|","|",1,{"$f":"INDEX(Q68:Q72,P11)","v":"Without extension (SW);"}]
[null,null,null,null,null,null,"|","|","|","|",null,"|","|","|","|",1,{"$f":"INDEX(Q75:Q77,P12)","v":"Without extension (HW);"}]
[null,null,null,null,null,null,"|","|","|","|",null,"|","|","|","|",3,{"$f":"INDEX(Q80:Q87,P13)","v":"2x PCIe (x16, x4);"}]
[null,null,null,null,null,null,"|","|","|","|",null,"|","|","|","|",null,"UHD Graphics on board; 2x DP; 1x DVI-D;","Link utili"]
[null,null,null,null,null,null,"|","|","|","|",null,"|","|","|","|",null,"3x Gigabit Ethernet (IE/PN) RJ45;","Certificati"]
[null,null,null,null,null,null,"|","|","|","|",null,"|","|","|","|",null,"6x USB 3.1 Gen.2; 1x serial (COM1);","Datasheet"]
[null,null,null,null,null,null,"|","|","|","|",null,"|","|","|","|",null,"RAID-Controller on board;","Manuale"]
[null,null,null,null,null,null,"|","|","|","|",null,"|","|","|","|",null,"Watchdog; Temperature/Fan monitoring; ","CAD 2D/3D"]
[null,null,null,null,null,null,"|","|","|","|",null,"|","|","|","|"]
[null,null,null,null,null,null,"|","|","|","|",null,"|","|","|","|",null,"Processor"]
[null,null,null,null,null,null,"A","|","|","|",null,"|","|","|","|",null,"Celeron G4900 (2C/2T, 3.1GHz, 2MB Cache; VT-d);",null,{"$f":"IF($P$6=1,\"X\",\"\")","v":"X"}]
[null,null,null,null,null,null,"B","|","|","|",null,"|","|","|","|",null,"Celeron G4900 (2C/2T, 3.1GHz, 2MB Cache; VT-d); NVRAM;",null,{"$f":"IF($P$6=2,\"X\",\"\")","v":""}]
[null,null,null,null,null,null,"C","|","|","|",null,"|","|","|","|",null,"Core i3-8100 (4C/4T, 3.6GHz, 6MB Cache, VT-d);",null,{"$f":"IF($P$6=3,\"X\",\"\")","v":""}]
[null,null,null,null,null,null,"D","|","|","|",null,"|","|","|","|",null,"Core i3-8100 (4C/4T, 3.6GHz, 6MB Cache, VT-d); NVRAM;",null,{"$f":"IF($P$6=4,\"X\",\"\")","v":""}]
[null,null,null,null,null,null,"G","|","|","|",null,"|","|","|","|",null,"Core i7-8700 (6C/12T, 3.2(4.6)GHz, 12MB Cache, VT-d, AMT);",null,{"$f":"IF($P$6=5,\"X\",\"\")","v":""}]
[null,null,null,null,null,null,"H","|","|","|",null,"|","|","|","|",null,"Core i7-8700 (6C/12T, 3.2(4.6)GHz, 12MB Cache, VT-d, AMT); NVRAM;",null,{"$f":"IF($P$6=6,\"X\",\"\")","v":""}]
[null,null,null,null,null,null,null,"|","|","|",null,"|","|","|","|"]
[null," ",null,null,null,null,null,"|","|","|",null,"|","|","|","|",null,"Drive"]
[null,null,null,null,{"$f":"IF(AND(OR($H$5=\"A\"),$J$5=5),1,0)","v":0},"\"This configuration has no UL Hazloc certification\"",null,"A","|","|",null,"|","|","|","|",null,"HDD 2.5\" SATA 320 GB internal;",null,{"$f":"IF($P$7=1,\"X\",\"\")","v":"X"}]
[null,null,null,null,null,null,null,"C","|","|",null,"|","|","|","|",null,"SSD 2.5\" SATA 480 GB internal;",null,{"$f":"IF($P$7=2,\"X\",\"\")","v":""}]
[null,null,null,null,null,null,null,"D","|","|",null,"|","|","|","|",null,"SSD 2.5\" SATA 960 GB internal;",null,{"$f":"IF($P$7=3,\"X\",\"\")","v":""}]
[null,null,null,null,null,null,null,"E","|","|",null,"|","|","|","|",null,"RAID1 2x SSD 2.5\" SATA 480 GB internal;",null,{"$f":"IF($P$7=4,\"X\",\"\")","v":""}]
[null,null,null,null,null,null,null,"G","|","|",null,"|","|","|","|",null,"RAID1 2x SSD 2.5\" SATA 480 GB in removable drive bay;",null,{"$f":"IF($P$7=5,\"X\",\"\")","v":""}]
[null,null,null,null,null,null,null,"H","|","|",null,"|","|","|","|",null,"RAID1 2x SSD 2.5\" SATA 960 GB in removable drive bay;",null,{"$f":"IF($P$7=6,\"X\",\"\")","v":""}]
[null,null,null,null,null,null,null,"J","|","|",null,"|","|","|","|",null,"M.2 SSD NVMe 512 GB;",null,{"$f":"IF($P$7=7,\"X\",\"\")","v":""}]
[null,null,null,null,{"$f":"IF(AND(OR($H$5=\"K\"),$J$5=5),1,0)","v":0},"\"This configuration has no UL Hazloc certification\"",null,"K","|","|",null,"|","|","|","|",null,"M.2 SSD NVMe 512 GB; HDD 2.5\" SATA 320 GB internal;",null,{"$f":"IF($P$7=8,\"X\",\"\")","v":""}]
[null,null,null,null,null,null,null,"L","|","|",null,"|","|","|","|",null,"M.2 SSD NVMe 512 GB; SSD 2.5\" SATA 480 GB internal;",null,{"$f":"IF($P$7=9,\"X\",\"\")","v":""}]
[null,null,null,null,null,null,null,"M","|","|",null,"|","|","|","|",null,"M.2 SSD NVMe 512 GB; SSD 2.5\" SATA 960 GB internal;",null,{"$f":"IF($P$7=10,\"X\",\"\")","v":""}]
[null,null,null,null,null,null,null,"Q","|","|",null,"|","|","|","|",null,"M.2 SSD NVMe 512 GB; RAID1 2x SSD 2.5\" SATA 480 GB in removable drive bay;",null,{"$f":"IF($P$7=11,\"X\",\"\")","v":""}]
[null,null,null,null,null,null,null,"S","|","|",null,"|","|","|","|",null,"M.2 SSD NVMe 512 GB; 2 removable drive bays w.o. media;",null,{"$f":"IF($P$7=12,\"X\",\"\")","v":""}]
[null,null,null,null,{"$f":"IF(AND(OR($L$5<8),$H$5=\"Y\"),1,0)","v":0},"\"Operating System requires a Mass Storage\"; "," ","Y","|","|",null,"|","|","|","|",null,"Without Drives (internal: 2x 2.5\" mounting options; incl. cables);",null,{"$f":"IF($P$7=13,\"X\",\"\")","v":""}]
[null,null,null,null,null,null,null,null,"|","|",null,"|","|","|","|"]
[null,null,null,null,null,null,null,null,"|","|",null,"|","|","|","|",null,"Main memory"]
[null,null,null,null,null,null,null,null,0,"|",null,"|","|","|","|",null,"4 GB DDR4-2666 (1x4);",null,{"$f":"IF($P$8=1,\"X\",\"\")","v":"X"}]
[null,null,null,null,null,null,null,null,1,"|",null,"|","|","|","|",null,"8 GB DDR4-2666 (2x4);",null,{"$f":"IF($P$8=2,\"X\",\"\")","v":""}]
[null,null,null,null,null,null,null,null,2,"|",null,"|","|","|","|",null,"16 GB DDR4-2666 (2x8);",null,{"$f":"IF($P$8=3,\"X\",\"\")","v":""}]
[null,null,null,null,null,null,null,null,3,"|",null,"|","|","|","|",null,"32 GB DDR4-2666 (2x16);",null,{"$f":"IF($P$8=4,\"X\",\"\")","v":""}]
[null,null,null,null,null,null,null,null,4,"|",null,"|","|","|","|",null,"64 GB DDR4-2666 (4x16);",null,{"$f":"IF($P$8=5,\"X\",\"\")","v":""}]
[null,null,null,null,null,null,null,null,null,"|",null,"|","|","|","|"]
[null,null,null,null,null,null,null,null,null,"|",null,"|","|","|","|",null,"Country specific type/ power supply"]
[null,null,null,null,null,null,null,null,null,0,null,"|","|","|","|",null,"DC 24V industrial power supply;",null,{"$f":"IF($P$9=1,\"X\",\"\")","v":"X"}]
[null,null,null,null,null,null,null,null,null,1,null,"|","|","|","|",null,"AC 110/230V Industrial PS with Namur; without power cord;",null,{"$f":"IF($P$9=2,\"X\",\"\")","v":""}]
[null,null,null,null,null,null,null,null,null,2,null,"|","|","|","|",null,"AC 110/230V Industrial PS with Namur; power cord Europe;",null,{"$f":"IF($P$9=3,\"X\",\"\")","v":""}]
[null,null,null,null,null,null,null,null,null,3,null,"|","|","|","|",null,"AC 110/230V Industrial PS with Namur; power cord US;",null,{"$f":"IF($P$9=4,\"X\",\"\")","v":""}]
[null,null,null,null,null,null,null,null,null,4,null,"|","|","|","|",null,"AC 110/230V Industrial PS with Namur; power cord China;",null,{"$f":"IF($P$9=5,\"X\",\"\")","v":""}]
[null,null,null,null,null,null,null,null,null,5,null,"|","|","|","|",null,"DC 24V industrial power supply; System certification UL HazLoc;",null,{"$f":"IF($P$9=6,\"X\",\"\")","v":""}]
[null,null,null,null,null,null,null,null,null,null,null,"|","|","|","|"]
[null,null,null,null,null,null,null,null,null,null,null,"|","|","|","|",null,"Operating system"]
[null,null,null,null,{"$f":"IF(AND(OR($G$5>\"E\"),$L$5=0),1,0)","v":0},"\"Wrong Windows 10 LTSB 2016 for Core-i7\"; "," ",null,null,null,null,0,"|","|","|",null,"Windows 10 Enterprise 2016 LTSB, 64Bit, MUI (En, Ger, Fr, It, Sp), for Celeron and i3;",null,{"$f":"IF($P$10=1,\"X\",\"\")","v":""}]
[null,null,null,null,{"$f":"IF(AND(OR($G$5<\"G\"),$L$5=1),1,0)","v":0},"\"Wrong 2016 LTSB  for Celeron/Core-i3\"; "," ",null,null,null,null,1,"|","|","|",null,"Windows 10 Enterprise 2016 LTSB, 64Bit, MUI (En, Ger, Fr, It, Sp), for Core i7;",null,{"$f":"IF($P$10=2,\"X\",\"\")","v":""}]
[null,null,null,null,{"$f":"IF(AND(OR($G$5>\"E\"),$L$5=2),1,0)","v":0},"\"Wrong Windows 10 LTSB 2016 for Core-i7\"; "," ",null,null,null,null,2,"|","|","|",null,"Windows 10 IoT Enterprise 2019 LTSC, 64Bit, MUI (En, Ger, Fr, It, Sp), for Celeron and i3;",null,{"$f":"IF($P$10=3,\"X\",\"\")","v":""}]
[null,null,null,null,{"$f":"IF(AND(OR($G$5<\"G\"),$L$5=3),1,0)","v":0},"\"Wrong 2016 LTSB  for Celeron/Core-i3\"; "," ",null,null,null,null,3,"|","|","|",null,"Windows 10 IoT Enterprise 2019 LTSC, 64Bit, MUI (En, Ger, Fr, It, Sp), for Core i7;",null,{"$f":"IF($P$10=4,\"X\",\"\")","v":""}]
["new",null,null,null,{"$f":"IF(AND(OR($G$5>\"E\"),$L$5=4),1,0)","v":0},"\"Wrong  Windows 10 LTSC 2021 for Core-i7\"; "," ",null,null,null,null,4,"|","|","|",null,"Windows 10 IoT Enterprise 2021 LTSC, 64Bit, MUI (en,de,fr,it,sp); for Celeron and i3;",null,{"$f":"IF($P$10=5,\"X\",\"\")","v":""}]
["new",null,null,null,{"$f":"IF(AND(OR($G$5<\"G\"),$L$5=5),1,0)","v":0},"Wrong  Windows 10 LTSC 2021 for Celeron/Core-i3; "," ",null,null,null,null,5,"|","|","|",null,"Windows 10 IoT Enterprise 2021 LTSC, 64Bit, MUI (en,de,fr,it,sp); for Core i7;",null,{"$f":"IF($P$10=6,\"X\",\"\")","v":""}]
[null,null,null,null,null,null,null,null,null,null,null,8,"|","|","|",null,"Without operating system;",null,{"$f":"IF($P$10=7,\"X\",\"\")","v":"X"}]
[null,null,null,null,null,null,null,null,null,null,null,null,"|","|","|"]
[null,null,null,null,null,null,null,null,null,null,null,null,"|","|","|",null,"Extension (SW)"]
[null,null,null,null,null,null,null,null,null,null,null,null,"A","|","|",null,"Without extension (SW);",null,{"$f":"IF($P$11=1,\"X\",\"\")","v":"X"}]
[null,null,null,null,null,null,null,null,null,null,null,null,"B","|","|",null,"SIMATIC IPC DiagMonitor added; ",null,{"$f":"IF($P$11=2,\"X\",\"\")","v":""}]
[null,null,null,null,null,null,null,null,null,null,null,null,"C","|","|",null,"SIMATIC IPC Image&Partition Creator added; ",null,{"$f":"IF($P$11=3,\"X\",\"\")","v":""}]
[null,null,null,null,null,null,null,null,null,null,null,null,"D","|","|",null,"SIMATIC IPC DiagMonitor, Image&Partition Creator added; ",null,{"$f":"IF($P$11=4,\"X\",\"\")","v":""}]
[null,null,null,null,null,null,null,null,null,null,null,null,"X","|","|",null,"TPM-Module;",null,{"$f":"IF($P$11=5,\"X\",\"\")","v":""}]
[null,null,null,null,null,null,null,null,null,null,null,null,null,"|","|"]
[null,null,null,null,null,null,null,null,null,null,null,null,null,"|","|",null,"Extension (HW)"]
[null,null,null,null,null,null,null,null,null,null,null,null,null,"A","|",null,"Without extension (HW);",null,{"$f":"IF($P$12=1,\"X\",\"\")","v":"X"}]
[null,null,null,null,{"$f":"IF(AND(OR($N$5=\"B\"),$J$5=5),1,0)","v":0},"\"This configuration has no UL Hazloc certification\"",null,null,null,null,null,null,null,"B","|",null,"2x USB 2.0 (1 slot occupied);",null,{"$f":"IF($P$12=2,\"X\",\"\")","v":""}]
[null,null,null,null,null,null,null,null,null,null,null,null,null,"C","|",null,"Device without CMOS Battery (CR2450N);",null,{"$f":"IF($P$12=3,\"X\",\"\")","v":""}]
[null,null,null,null,null,null,null,null,null,null,null,null,null,null,"|"]
[null,null,null,null,null,null,null,null,null,null,null,null,null,null,"|",null,"Extension (HW)"]
[null,null,null,null,null,null,null,null,null,null,null,null,null,null,0,null,"2x PCI;",null,{"$f":"IF($P$13=1,\"X\",\"\")","v":""}]
[null,null,null,null,null,null,null,null,null,null,null,null,null,null,1,null,"1x PCIe (x16), 1x PCI;",null,{"$f":"IF($P$13=2,\"X\",\"\")","v":""}]
[null,null,null,null,null,null,null,null,null,null,null,null,null,null,2,null,"2x PCIe (x16, x4);",null,{"$f":"IF($P$13=3,\"X\",\"\")","v":"X"}]
[null,null,null,null,{"$f":"IF(AND(OR($O$5=\"3\"),$J$5=5),1,0)","v":0},"\"This configuration has no UL Hazloc certification\"",null,null,null,null,null,null,null,null,3,null,"3x PCI, 2x PCIe (x16, x4);",null,{"$f":"IF($P$13=4,\"X\",\"\")","v":""}]
["New",null,null,null,{"$f":"IF(AND(OR($O$5=\"4\"),$J$5=5),1,0)","v":0},"\"This configuration has no UL Hazloc certification\"",null,null,null,null,null,null,null,null,4,null,"5x PCIe (1 x16, 1 x4, 3 x1);",null,{"$f":"IF($P$13=5,\"X\",\"\")","v":""}]
[null,null,null,null,null,null,null,null,null,null,null,null,null,null,5,null,"2x PCI; painted housing;",null,{"$f":"IF($P$13=6,\"X\",\"\")","v":""}]
[null,null,null,null,null,null,null,null,null,null,null,null,null,null,6,null,"1x PCIe (x16), 1x PCI; painted housing;",null,{"$f":"IF($P$13=7,\"X\",\"\")","v":""}]
[null,null,null,null,null,null,null,null,null,null,null,null,null,null,7,null,"2x PCIe (x16, x4); painted housing;",null,{"$f":"IF($P$13=8,\"X\",\"\")","v":""}]
[]
[null,null,null,null,null,null,null,null,null,null,null,null,null,null,null,null,null,"Base Unit ","X"]
[]
[{"$f":"A$5","v":"6AG4"},1,3,1,"-",3,{"$f":"G5","v":"A"},{"$f":"H5","v":"A"},{"$f":"I5","v":0},{"$f":"J5","v":0},"-",{"$f":"L5","v":8},{"$f":"M5","v":"A"},{"$f":"N5","v":"A"},{"$f":"O5","v":2},null,null,"Total:"]
[]
[]
["Zubehör:"]
[]
[null,null,null,null,null,null,null,null,null,null,null,null,null,null,null,null,"Memory Extension"]
["6ES7648-2AL60-0QA0",null,null,null,null,null,null,null,null,null,null,null,null,null,null,null,"4 GB DDR4 DIMM (1x 4); "]
["6ES7648-2AL70-0QA0",null,null,null,null,null,null,null,null,null,null,null,null,null,null,null,"8 GB DDR4 DIMM (1x 8); "]
["6ES7648-2AL80-0QA0",null,null,null,null,null,null,null,null,null,null,null,null,null,null,null,"16 GB DDR4 DIMM (1x 16); "]
[]
[null,null,null,null,null,null,null,null,null,null,null,null,null,null,null,null,"Mounting Accessory"]
["6ES7648-1AA10-2YA0 ",null,null,null,null,null,null,null,null,null,null,null,null,null,null,null,"Book mounting kit for box IPC627E (2 slots), PC interface outlet top or bottom;"]
["6ES7648-1AA10-2YB0",null,null,null,null,null,null,null,null,null,null,null,null,null,null,null,"Book mounting kit front for Box IPC627E (2 slots), PC interface outlet front side;"]
["6ES7648-1AA30-2YA0 ",null,null,null,null,null,null,null,null,null,null,null,null,null,null,null,"Book mounting kit for box IPC627E (5 slots), PC interface outlet top or bottom;"]
["6ES7648-1AA30-2YB0 ",null,null,null,null,null,null,null,null,null,null,null,null,null,null,null,"Book mounting kit front for box IPC627E (5 slots), PC interface outlet front side;"]

{"sheet":"IPC277E (Panel PC)","index":22,"n_rows":86,"n_cols":19,"rows_kept":86,"cut":false,"hidden":false,"merged":[]}
["SIMATIC IPC277E (Nanopanel PC)",null,null,null,null,null,null,null,null,null,null,null,null,null,null,null,"IPC superato da IPC 277G - IPC 377G"]
[]
[null,null,null,null,null,null,null,null,null,null,null,null,null,null,null,null,{"$f":"IF(F48,G48,\"\")&IF(F49,G49,\"\")&IF(F50,G50,\"\")&IF(F51,G51,\"\")&IF(F52,G52,\"\")&IF(F53,G53,\"\")&IF(F54,G54,\"\")&IF(F55,G55,\"\")","v":""}]
[]
["6AV7",8,8,2,"-",0,{"$f":"IF(P7=1,G21,)&IF(P7=2,G22,)&IF(P7=3,G23,)&IF(P7=4,G24,)&IF(P7=5,G25,)&IF(P7=6,G26,)&IF(P7=7,G27,)&IF(P7=8,G28,)&IF(P7=9,G29,)&IF(P7=10,G30,)","v":"A"},{"$f":"IF(P8=1,H33,)&IF(P8=2,H34,)&IF(P8=3,H35,)&IF(P8=4,H36,)","v":"A"},{"$f":"IF(P9=1,I39,)&IF(P9=2,I40,)&IF(P9=3,I41,)&IF(P9=4,I42,)&IF(P9=5,I43,)&IF(P9=6,I44,)","v":"1"},0,"-",{"$f":"IF(P10=1,L47,)&IF(P10=2,L48,)&IF(P10=3,L49,)&IF(P10=4,L50,)&IF(P10=5,L51,)&IF(P10=6,L52,)&IF(P10=7,L53,)&IF(P10=8,L54,)&IF(P10=9,L55,)","v":"0"},{"$f":"IF(P11=1,M58,)&IF(P11=2,M59,)&IF(P11=3,M60,)&IF(P11=4,M61,)&IF(P11=5,M62,)&IF(P11=6,M63,)&IF(P11=7,M64,)&IF(P11=8,M65,)","v":"A"},"A",0,null,{"$f":"\"SIMATIC IPC277E (Nanopanel PC)\"","v":"SIMATIC IPC277E (Nanopanel PC)"},{"$f":"$A$5&$B$5&$C$5&$D$5&$E$5&$F$5&$G$5&$H$5&$I$5&$J$5&$K$5&$L$5&$M$5&$N$5&$O$5","v":"6AV7882-0AA10-0AA0"}]
[null,null,null,null,null,"|","|","|","|",null,null,"|","|","|",null,1,{"$f":"Q18","v":"Standard device"}]
[null,null,null,null,null,"|","|","|","|",null,null,"|","|","|",null,1,{"$f":"IF(P7=1,Q21,)&IF(P7=2,Q22,)&IF(P7=3,Q23,)&IF(P7=4,Q24,)&IF(P7=5,Q25,)&IF(P7=6,Q26,)&IF(P7=7,Q27,)&IF(P7=8,Q28,)&IF(P7=9,Q29,)&IF(P7=10,Q30,)","v":"7\" Singletouch (800 x 480)"}]
[null,null,null,null,null,"|","|","|","|",null,null,"|","|","|",null,1,{"$f":"IF(P8=1,Q33,)&IF(P8=2,Q34,)&IF(P8=3,Q35,)&IF(P8=4,Q36,)","v":"Celeron N2807 (2C/2T)"},"Link utili"]
[null,null,null,null,null,"|","|","|","|",null,null,"|","|","|",null,1,{"$f":"IF(P9=1,Q39,)&IF(P9=2,Q40,)&IF(P9=3,Q41,)&IF(P9=4,Q42,)&IF(P9=5,Q43,)&IF(P9=6,Q44,)","v":"2 GB RAM"},"Certificati"]
[null,null,null,null,null,"|","|","|","|",null,null,"|","|","|",null,1,{"$f":"IF(P10=1,Q47,)&IF(P10=2,Q48,)&IF(P10=3,Q49,)&IF(P10=4,Q50,)&IF(P10=5,Q51,)&IF(P10=6,Q52,)&IF(P10=7,Q53,)&IF(P10=8,Q54,)&IF(P10=9,Q55,)","v":"without Windows operating system"},"Datasheet"]
[null,null,null,null,null,"|","|","|","|",null,null,"|","|","|",null,1,{"$f":"IF(P11=1,Q58,)&IF(P11=2,Q59,)&IF(P11=3,Q60,)&IF(P11=4,Q61,)&IF(P11=5,Q62,)&IF(P11=6,Q63,)&IF(P11=7,Q64,)&IF(P11=8,Q65,)","v":"without drive, with CFast-Slot"},"Manuale"]
[null,null,null,null,null,"|","|","|","|",null,null,"|","|","|",null,1,{"$f":"Q68","v":"without SIMATIC Software"},"CAD 2D/3D"]
[null,null,null,null,null,"|","|","|","|",null,null,"|","|","|"]
[null,null,null,null,null,"|","|","|","|",null,null,"|","|","|"]
[null,null,null,null,null,"|","|","|","|",null,null,"|","|","|"]
[null,null,null,null,null,"|","|","|","|",null,null,"|","|","|"]
[null," ",null,null,null,"|","|","|","|",null,null,"|","|","|",null,null,"Device type"]
[null," ",null,null,null,0,"|","|","|",null,null,"|","|","|",null,null,"Standard device",null,{"$f":"IF($P$6=1,\"X\",\"\")","v":"X"}]
[null," ",null,null,null,null,"|","|","|",null,null,"|","|","|"]
[null," ",null,null,null,null,"|","|","|",null,null,"|","|","|",null,null,"Front Panel"]
[null," ",null,null,null,null,"A","|","|",null,null,"|","|","|",null,null,"7\" Singletouch (800 x 480)",null,{"$f":"IF($P$7=1,\"X\",\"\")","v":"X"}]
[null," ",null,null,null,null,"B","|","|",null,null,"|","|","|",null,null,"9\" Singletouch (800 x 480)",null,{"$f":"IF($P$7=2,\"X\",\"\")","v":""}]
[null," ",null,null,null,null,"C","|","|",null,null,"|","|","|",null,null,"12\" Singletouch (1280 x 800)",null,{"$f":"IF($P$7=3,\"X\",\"\")","v":""}]
[null," ",null,null,null,null,"D","|","|",null,null,"|","|","|",null,null,"15\" Singletouch (1280 x 800), Front-USB",null,{"$f":"IF($P$7=4,\"X\",\"\")","v":""}]
[null," ",null,null,null,null,"E","|","|",null,null,"|","|","|",null,null,"19\" Singletouch (1366 x 768), Front-USB",null,{"$f":"IF($P$7=5,\"X\",\"\")","v":""}]
[null,null,null,null,null,null,"H","|","|",null,null,"|","|","|",null,null,"12\" Multitouch (1280 x 800; with WES7-E only ST-mode)",null,{"$f":"IF($P$7=6,\"X\",\"\")","v":""}]
[null,null,null,null,null,null,"F","|","|",null,null,"|","|","|",null,null,"15\" Multitouch (1366 x 768; with WES7-E only ST-mode)",null,{"$f":"IF($P$7=7,\"X\",\"\")","v":""}]
[null,null,null,null,null,null,"G","|","|",null,null,"|","|","|",null,null,"19\" Multitouch (1366 x 768; with WES7-E only ST-mode)",null,{"$f":"IF($P$7=8,\"X\",\"\")","v":""}]
[null,null,null,null,null,null,"J","|","|",null,null,"|","|","|",null,null,"15\" Multitouch (1366 x 768; ATEX/IECEx/UL HazLoc; with WES7-E only ST-mode)",null,{"$f":"IF($P$7=9,\"X\",\"\")","v":""}]
[null,null,null,null,null,null,"K","|","|",null,null,"|","|","|",null,null,"19\" Multitouch (1366 x 768) ATEX/IECEx/UL HazLoc; with WES7-E only ST-mode)",null,{"$f":"IF($P$7=10,\"X\",\"\")","v":""}]
[null,null,null,null,null,null,null,"|","|",null,null,"|","|","|"]
[null," ",null,null,null,null,null,"|","|",null,null,"|","|","|",null,null,"Processor / TPM"]
[null," ",null,null,null,null,null,"A","|",null,null,"|","|","|",null,null,"Celeron N2807 (2C/2T)",null,{"$f":"IF($P$8=1,\"X\",\"\")","v":"X"}]
[null," ",null,null,null,null,null,"B","|",null,null,"|","|","|",null,null,"Celeron N2930 (4C/4T)",null,{"$f":"IF($P$8=2,\"X\",\"\")","v":""}]
[null," ",null,null,null,null,null,"C","|",null,null,"|","|","|",null,null,"Celeron N2807 (2C/2T) / TPM",null,{"$f":"IF($P$8=3,\"X\",\"\")","v":""}]
[null," ",null,null,null,null,null,"D","|",null,null,"|","|","|",null,null,"Celeron N2930 (4C/4T) / TPM",null,{"$f":"IF($P$8=4,\"X\",\"\")","v":""}]
[null," ",null,null,null,null,null,null,"|",null,null,"|","|","|"]
[null," ",null,null,null,null,null,null,"|",null,null,"|","|","|",null,null,"RAM / NVRAM"]
[null," ",null,null,null,null,null,null,1,null,null,"|","|","|",null,null,"2 GB RAM",null,{"$f":"IF($P$9=1,\"X\",\"\")","v":"X"}]
[null," ",null,null,null," ",null,null,2,null,null,"|","|","|",null,null,"4 GB RAM",null,{"$f":"IF($P$9=2,\"X\",\"\")","v":""}]
[null," ",null,null,null," ",null,null,3,null,null,"|","|","|",null,null,"8 GB RAM",null,{"$f":"IF($P$9=3,\"X\",\"\")","v":""}]
[null,null,null,null,null,null,null,null,4,null,null,"|","|","|",null,null,"2 GB RAM / NVRAM",null,{"$f":"IF($P$9=4,\"X\",\"\")","v":""}]
[null,null,null,null,null," ",null,null,5,null,null,"|","|","|",null,null,"4 GB RAM / NVRAM",null,{"$f":"IF($P$9=5,\"X\",\"\")","v":""}]
[null,null,null,null,null," ",null,null,6,null,null,"|","|","|",null,null,"8 GB RAM / NVRAM",null,{"$f":"IF($P$9=6,\"X\",\"\")","v":""}]
[null," ",null,null,null," ",null,null,null,null,null,"|","|","|"]
[null," ",null,null,null,null,null,null,null,null,null,"|","|","|",null,null,"Operating system"]
[null," ",null,null,null,null,null,null,null,null,null,0,"|","|",null,null,"without Windows operating system",null,{"$f":"IF($P$10=1,\"X\",\"\")","v":"X"}]
[null," ",null,null,null,{"$f":"IF(OR(AND($P$10=2,$P$11=1),AND($P$10=2,$P$11=5)),1,0)","v":0},"WES7E (32 bit) with SSD or CFast from 8 GB","  ",null,null,null,1,"|","|",null,null,"Windows Embedded Standard 7 E SP1, english, 32Bit",null,{"$f":"IF($P$10=2,\"X\",\"\")","v":""}]
[null," ",null,null,null,{"$f":"IF(OR(AND($P$10=3,$P$11=1),AND($P$10=3,$P$11=5),AND($P$10=3,$P$11=6)),1,0)","v":0},"WES7E (64 bit) with SSD or CFast from 16 GB","  ",null,null,null,2,"|","|",null,null,"Windows Embedded Standard 7 E SP1, english, 64Bit",null,{"$f":"IF($P$10=3,\"X\",\"\")","v":""}]
[null," ",null,null,null,{"$f":"IF(OR(AND($P$10=4,$P$11=1),AND($P$10=4,$P$11=5),AND($P$10=4,$P$11=6)),1,0)","v":0},"WES7P (32 bit) with SSD or CFast from 16 GB","  ",null,null,null,3,"|","|",null,null,"Windows Embedded Standard 7 P SP1, MUI, 32Bit",null,{"$f":"IF($P$10=4,\"X\",\"\")","v":""}]
[null," ",null,null,null,{"$f":"IF(OR(AND($P$10=5,$P$11=1),AND($P$10=5,$P$11=5),AND($P$10=5,$P$11=6)),1,0)","v":0},"WES7P (64 bit) with SSD or CFast from 16 GB"," ",null,null,null,4,"|","|",null,null,"Windows Embedded Standard 7 P SP1, MUI, 64Bit",null,{"$f":"IF($P$10=5,\"X\",\"\")","v":""}]
[null," ",null,null,null,{"$f":"IF(AND($L$5=\"5\",OR($M$5=\"A\",$M$5=\"K\",$M$5=\"L\",$M$5=\"M\",$M$5=\"N\",)),1,0)","v":0},"W7 only with SSD","  ",null,null,null,5,"|","|",null,null,"Windows7 Ultimate SP1, 32Bit, MUI (En, Ger, Es, Fr, It)",null,{"$f":"IF($P$10=6,\"X\",\"\")","v":""}]
[null," ",null,null,null,{"$f":"IF(AND($L$5=\"6\",OR($M$5=\"A\",$M$5=\"K\",$M$5=\"L\",$M$5=\"M\",$M$5=\"N\",)),1,0)","v":0},"W7 only with SSD"," ",null,null,null,6,"|","|",null,null,"Windows7 Ultimate SP1, 64Bit, MUI (En, Ger, Es, Fr, It)",null,{"$f":"IF($P$10=7,\"X\",\"\")","v":""}]
[null," ",null,null,null,{"$f":"IF(AND($L$5=\"7\",OR($M$5=\"A\",$M$5=\"K\",$M$5=\"L\",$M$5=\"M\",)),1,0)","v":0},"W10 only with SSD / 128 GB CFast"," ",null,null,null,7,"|","|",null,null,"Windows 10 IoT Enterprise 2016 LTSB, 64Bit, MUI (Ger, En, Es, Fr, It)",null,{"$f":"IF($P$10=8,\"X\",\"\")","v":""}]
[null," ",null,null,null,{"$f":"IF(AND($L$5=\"8\",OR($M$5=\"A\",$M$5=\"K\",$M$5=\"L\",$M$5=\"M\",)),1,0)","v":0},"W10 only with SSD / 128 GB CFast"," ",null,null,null,8,"|","|",null,null,"Windows 10 IoT Enterprise 2019 LTSC, 64Bit, MUI (Ger, En, Es, Fr, It)",null,{"$f":"IF($P$10=9,\"X\",\"\")","v":""}]
[null," ",null,null,null," ",null,null,null,null,null,null,"|","|"]
[null," ",null,null,null,null,null,null,null,null,null,null,"|","|",null,null,"Drive"]
[null," ",null,null,null,null,null,null,null,null,null,null,"A","|",null,null,"without drive, with CFast-Slot",null,{"$f":"IF($P$11=1,\"X\",\"\")","v":"X"}]
[null," ",null,null,null,null,null,null,null,null,null,null,"C","|",null,null,"240 GB SSD",null,{"$f":"IF($P$11=2,\"X\",\"\")","v":""}]
[null," ",null,null,null,null,null,null,null,null,null,null,"D","|",null,null,"480 GB SSD",null,{"$f":"IF($P$11=3,\"X\",\"\")","v":""}]
[null," ",null,null,null,null,null,null,null,null,null,null,"E","|",null,null,"256 GB Eco SSD",null,{"$f":"IF($P$11=4,\"X\",\"\")","v":""}]
[null," ",null,null,null,null,null,null,null,null,null,null,"K","|",null,null,"4 GB CFast",null,{"$f":"IF($P$11=5,\"X\",\"\")","v":""}]
[null," ",null,null,null,null,null,null,null,null,null,null,"L","|",null,null,"8 GB CFast",null,{"$f":"IF($P$11=6,\"X\",\"\")","v":""}]
[null," ",null,null,null,null,null,null,null,null,null,null,"M","|",null,null,"16 GB CFast",null,{"$f":"IF($P$11=7,\"X\",\"\")","v":""}]
[null," ",null,null,null,null,null,null,null,null,null,null,"N","|",null,null,"128 GB CFast",null,{"$f":"IF($P$11=8,\"X\",\"\")","v":""}]
[null," ",null,null,null," ",null,null,null,null,null,null,null,"|"]
[null," ",null,null,null,null,null,null,null,null,null,null,null,"|",null,null,"Software configuration"]
[null," ",null,null,null,null,null,null,null,null,null,null,null,"A",null,null,"without SIMATIC Software",null,{"$f":"IF($P$12=1,\"X\",\"\")","v":"X"}]
[null," "]
[]
[null,null,null,null,null,null,null,null,null,null,null,null,null,null,null,null,"Base version",null,"X"]
[]
[{"$f":"A5","v":"6AV7"},{"$f":"B5","v":8},{"$f":"C5","v":8},{"$f":"D5","v":2}," - ",{"$f":"F5","v":0},"A","A","1",0,"-","0","A","A",0,null,null,"Total:"]
[]
[]
["Accessories:"]
[]
[null,null,null,null,null,null,null,null,null,null,null,null,null,null,null,null,"Protection Slides"]
["6AV2124-6GJ00-0AX0",null,null,null,null,null,null,null,null,null,null,null,null,null,null,null,"PROTECTIVE FILM  7\" 205MM X 149MM"]
["6AV2124-6JJ00-0AX0",null,null,null,null,null,null,null,null,null,null,null,null,null,null,null,"PROTECTIVE FILM  9\" 265MM X 181MM"]
["6AV2124-6MJ00-0AX0",null,null,null,null,null,null,null,null,null,null,null,null,null,null,null,"PROTECTIVE FILM 12\" 321MM X 232MM"]
["6AV2124-6QJ00-0AX1",null,null,null,null,null,null,null,null,null,null,null,null,null,null,null,"PROTECTIVE FILM 15\" 368MM X 259MM"]
["6AV2124-6UJ00-0AX1",null,null,null,null,null,null,null,null,null,null,null,null,null,null,null,"PROTECTIVE FILM 19\" 451MM X 285MM"]
[]
[null,null,null,null,null,null,null,null,null,null,null,null,null,null,null,null,"Mounting Accessory"]
["6AV6671-8XK00-0AX4",null,null,null,null,null,null,null,null,null,null,null,null,null,null,null,"BRACKET CLAMP LONG CLAMP SET (10 pieces, for 15\"/19\"/22\")"]

{"sheet":"IPC277G (Panel PC)","index":23,"n_rows":76,"n_cols":21,"rows_kept":76,"cut":false,"hidden":false,"merged":[]}
["SIMATIC IPC277G  (Nanopanel PC)",null,null,null,null,null,null,null,null,null,null,null,null,null,null,null,null,null,null,null,"."]
[]
[]
[null,null,null,null,null,null,null,null,null,null,null,null,null,null,null,null,{"$f":"IF(B69,C69,\"\")&IF(B70,C70,\"\")&IF(B55,C55,\"\")","v":""}]
["6AV7",8,8,6,"-",{"$f":"IF(P6<22,F16,1)","v":0},{"$f":"IF(P6=1,G16,)&IF(P6=2,G17,)&IF(P6=3,G18,)&IF(P6=4,G19,)&IF(P6=5,G20,)&IF(P6=6,G21,)&IF(P6=7,G22,)&IF(P6=8,G23,)&IF(P6=9,G24,)&IF(P6=10,G25,)&IF(P6=11,G26,)&IF(P6=12,G27,)&IF(P6=13,G28,)&IF(P6=14,G29,)&IF(P6=15,G30,)&IF(P6=16,G31,)&IF(P6=17,G32,)&IF(P6=18,G33,)&IF(P6=19,G34,)&IF(P6=20,G35,)&IF(P6=21,G36,)","v":"A"},{"$f":"IF(P7=1,H39,)&IF(P7=2,H40,)&IF(P7=3,H41,)&IF(P7=4,H42,)&IF(P7=5,H43,)&IF(P7=6,H44,)","v":"A"},{"$f":"IF(P8=1,I47,)&IF(P8=2,I48,)&IF(P8=3,I49,)","v":"1"},{"$f":"IF(P9=1,J52,)&IF(P9=2,J53,)&IF(P9=3,J54,)&IF(P9=4,J55,)","v":"1"},"-",{"$f":"IF(P10=1,L58,)&IF(P10=2,L59,)&IF(P10=3,L60,)&IF(P10=4,L61,)","v":"1"},{"$f":"IF(P11=1,M64,)&IF(P11=2,M65,)","v":"A"},{"$f":"IF(P12=1,N68,)&IF(P12=2,N69,)&IF(P12=3,N70,)","v":"A"},0,null,{"$f":"\"SIMATIC IPC277G  (Nanopanel PC)\"","v":"SIMATIC IPC277G  (Nanopanel PC)"},{"$f":"$A$5&$B$5&$C$5&$D$5&$E$5&$F$5&$G$5&$H$5&$I$5&$J$5&$K$5&$L$5&$M$5&$N$5&$O$5","v":"6AV7886-0AA11-1AA0"}]
[null,null,null,null,null,null,"|","|","|","|",null,"|","|","|",null,1,{"$f":"IF(P6=1,Q16,)&IF(P6=2,Q17,)&IF(P6=3,Q18,)&IF(P6=4,Q19,)&IF(P6=5,Q20,)&IF(P6=6,Q21,)&IF(P6=7,Q22,)&IF(P6=8,Q23,)&IF(P6=9,Q24,)&IF(P6=10,Q25,)&IF(P6=11,Q26,)&IF(P6=12,Q27,)&IF(P6=13,Q28,)&IF(P6=14,Q29,)&IF(P6=15,Q30,)&IF(P6=16,Q31,)&IF(P6=17,Q32,)&IF(P6=18,Q33,)&IF(P6=19,Q34,)&IF(P6=20,Q35,)&IF(P6=21,Q36,)","v":"7\" Multitouch (800 x 480)"}]
[null,null,null,null,null,null,"|","|","|","|",null,"|","|","|",null,1,{"$f":"IF(P7=1,Q39,)&IF(P7=2,Q40,)&IF(P7=3,Q41,)&IF(P7=4,Q42,)&IF(P7=5,Q43,)&IF(P7=6,Q44,)","v":"Atom X6413E (2-Core)"}]
[null,null,null,null,null,null,"|","|","|","|",null,"|","|","|",null,1,{"$f":"IF(P8=1,Q47,)&IF(P8=2,Q48,)&IF(P8=3,Q49,)","v":"4 GB RAM"},"Link utili"]
[null,null,null,null,null,null,"|","|","|","|",null,"|","|","|",null,1,{"$f":"IF(P9=1,Q52,)&IF(P9=2,Q53,)&IF(P9=3,Q54,)&IF(P9=4,Q55,)","v":"without COM"},"Certificati"]
[null,null,null,null,null,null,"|","|","|","|",null,"|","|","|",null,1,{"$f":"IF(P10=1,Q58,)&IF(P10=2,Q59,)&IF(P10=3,Q60,)&IF(P10=4,Q61,)","v":"without drive"},"Datasheet"]
[null,null,null,null,null,null,"|","|","|","|",null,"|","|","|",null,1,{"$f":"IF(P11=1,Q64,)&IF(P11=2,Q65,)","v":"without HW extension"},"Manuale"]
[null,null,null,null,null,null,"|","|","|","|",null,"|","|","|",null,1,{"$f":"IF(P12=1,Q68,)&IF(P12=2,Q69,)&IF(P12=3,Q70,)","v":"without Software"},"CAD 2D/3D"]
[null,null,null,null,null,null,"|","|","|","|",null,"|","|","|"]
[null,null,null,null,null,null,"|","|","|","|",null,"|","|","|"]
[null,null,null,null,null,null,"|","|","|","|",null,"|","|","|",null,null,"Front Panel"]
[null,null,null,null,null,null,"A","|","|","|",null,"|","|","|",null,null,"7\" Multitouch (800 x 480)",null,{"$f":"IF($P$6=1,\"X\",\"\")","v":"X"}]
[null,null,null,null,null,null,"B","|","|","|",null,"|","|","|",null,null,"10\" Multitouch (1280 x 800)",null,{"$f":"IF($P$6=2,\"X\",\"\")","v":""}]
[null,null,null,null,null,null,"C","|","|","|",null,"|","|","|",null,null,"12\" Multitouch (1280 x 800)",null,{"$f":"IF($P$6=3,\"X\",\"\")","v":""}]
[null,null,null,null,null,null,"D","|","|","|",null,"|","|","|",null,null,"15\" Multitouch (1920 x 1080)",null,{"$f":"IF($P$6=4,\"X\",\"\")","v":""}]
[null,null,null,null,null,null,"E","|","|","|",null,"|","|","|",null,null,"19\" Multitouch (1920 x 1080)",null,{"$f":"IF($P$6=5,\"X\",\"\")","v":""}]
[null,null,null,null,null,null,"F","|","|","|",null,"|","|","|",null,null,"22\" Multitouch (1920 x 1080)",null,{"$f":"IF($P$6=6,\"X\",\"\")","v":""}]
[null,null,null,null,null,null,"G","|","|","|",null,"|","|","|",null,null,"24\" Multitouch (1920 x 1080)",null,{"$f":"IF($P$6=7,\"X\",\"\")","v":""}]
[null,null,null,null,null,null,"H","|","|","|",null,"|","|","|",null,null,"7\" Multitouch (800 x 480) ATEX/IECEx/UL HazLoc",null,{"$f":"IF($P$6=8,\"X\",\"\")","v":""}]
[null,null,null,null,null,null,"J","|","|","|",null,"|","|","|",null,null,"10\" Multitouch (1280 x 800) ATEX/IECEx/UL HazLoc",null,{"$f":"IF($P$6=9,\"X\",\"\")","v":""}]
[null,null,null,null,null,null,"K","|","|","|",null,"|","|","|",null,null,"12\" Multitouch (1280 x 800) ATEX/IECEx/UL HazLoc",null,{"$f":"IF($P$6=10,\"X\",\"\")","v":""}]
[null,null,null,null,null,null,"L","|","|","|",null,"|","|","|",null,null,"15\" Multitouch (1920 x 1080) ATEX/IECEx/UL HazLoc",null,{"$f":"IF($P$6=11,\"X\",\"\")","v":""}]
[null,null,null,null,null,null,"M","|","|","|",null,"|","|","|",null,null,"19\" Multitouch (1920 x 1080) ATEX/IECEx/UL HazLoc",null,{"$f":"IF($P$6=12,\"X\",\"\")","v":""}]
[null,null,null,null,null,null,"N","|","|","|",null,"|","|","|",null,null,"22\" Multitouch (1920 x 1080) ATEX/IECEx/UL HazLoc",null,{"$f":"IF($P$6=13,\"X\",\"\")","v":""}]
[null,null,null,null,null,null,"P","|","|","|",null,"|","|","|",null,null,"24\" Multitouch (1920 x 1080) ATEX/IECEx/UL HazLoc",null,{"$f":"IF($P$6=14,\"X\",\"\")","v":""}]
[null,null,null,null,null,null,"Q","|","|","|",null,"|","|","|",null,null,"7\" (800 x 480) Multitouch Neutral Front",null,{"$f":"IF($P$6=15,\"X\",\"\")","v":""}]
[null,null,null,null,null,null,"R","|","|","|",null,"|","|","|",null,null,"10\" (1280 x 800) Multitouch Neutral Front",null,{"$f":"IF($P$6=16,\"X\",\"\")","v":""}]
[null,null,null,null,null,null,"S","|","|","|",null,"|","|","|",null,null,"12\" (1280 x 800) Multitouch Neutral Front",null,{"$f":"IF($P$6=17,\"X\",\"\")","v":""}]
[null,null,null,null,null,null,"T","|","|","|",null,"|","|","|",null,null,"15\" (1920 x 1080) Multitouch Neutral Front",null,{"$f":"IF($P$6=18,\"X\",\"\")","v":""}]
[null,null,null,null,null,null,"U","|","|","|",null,"|","|","|",null,null,"19\" (1920 x 1080) Multitouch Neutral Front",null,{"$f":"IF($P$6=19,\"X\",\"\")","v":""}]
[null,null,null,null,null,null,"V","|","|","|",null,"|","|","|",null,null,"22\" (1920 x 1080) Multitouch Neutral Front",null,{"$f":"IF($P$6=20,\"X\",\"\")","v":""}]
[null,null,null,null,null,null,"W","|","|","|",null,"|","|","|",null,null,"24\" (1920 x 1080) Multitouch Neutral Front",null,{"$f":"IF($P$6=21,\"X\",\"\")","v":""}]
[null,null,null,null,null,null,null,"|","|","|",null,"|","|","|",null,null,null,null,""]
[null," ",null,null,null,null,null,"|","|","|",null,"|","|","|",null,null,"Processor / TPM"]
[null,null,null,null,null,null,null,"A","|","|",null,"|","|","|",null,null,"Atom X6413E (2-Core)",null,{"$f":"IF($P$7=1,\"X\",\"\")","v":"X"}]
[null,null,null,null,null,null,null,"B","|","|",null,"|","|","|",null,null,"Atom X6413E (4-Core)",null,{"$f":"IF($P$7=2,\"X\",\"\")","v":""}]
[null,null,null,null,null,null,null,"C","|","|",null,"|","|","|",null,null,"Atom X6414RE (4-Core)",null,{"$f":"IF($P$7=3,\"X\",\"\")","v":""}]
[null,null,null,null,null,null,null,"D","|","|",null,"|","|","|",null,null,"Atom X6413E (2-Core) / TPM",null,{"$f":"IF($P$7=4,\"X\",\"\")","v":""}]
[null,null,null,null,null,null,null,"E","|","|",null,"|","|","|",null,null,"Atom X6413E (4-Core) / TPM",null,{"$f":"IF($P$7=5,\"X\",\"\")","v":""}]
[null,null,null,null,null,null,null,"F","|","|",null,"|","|","|",null,null,"Atom X6414RE (4-Core) / TPM",null,{"$f":"IF($P$7=6,\"X\",\"\")","v":""}]
[null,null,null,null,null,null,null,null,"|","|",null,"|","|","|"]
[null,null,null,null,null,null,null,null,"|","|",null,"|","|","|",null,null,"RAM"]
[null,null,null,null,null,null,null,null,1,"|",null,"|","|","|",null,null,"4 GB RAM",null,{"$f":"IF($P$8=1,\"X\",\"\")","v":"X"}]
[null,null,null,null,null,null,null,null,2,"|",null,"|","|","|",null,null,"8 GB RAM",null,{"$f":"IF($P$8=2,\"X\",\"\")","v":""}]
[null,null,null,null,null,null,null,null,3,"|",null,"|","|","|",null,null,"16 GB RAM",null,{"$f":"IF($P$8=3,\"X\",\"\")","v":""}]
[null,null,null,null,null,null,null,null,null,"|",null,"|","|","|"]
[null,null,null,null,null,null,null,null,null,"|",null,"|","|","|",null,null,"Hardware configuration"]
[null,null,null,null,null,null,null,null,null,1,null,"|","|","|",null,null,"without COM",null,{"$f":"IF($P$9=1,\"X\",\"\")","v":"X"}]
[null,null,null,null,null,null,null,null,null,2,null,"|","|","|",null,null,"1x COM",null,{"$f":"IF($P$9=2,\"X\",\"\")","v":""}]
[null,null,null,null,null,null,null,null,null,3,null,"|","|","|",null,null,"2x COM",null,{"$f":"IF($P$9=3,\"X\",\"\")","v":""}]
[null,{"$f":"IF(AND(($P$9=4),(OR($P$6=1,$P$6=2,$P$6=3,$P$6=8,$P$6=9,$P$6=10,$P$6=11,$P$6=12,$P$6=13,$P$6=14,$P$6=15,$P$6=16,$P$6=17))),1,0)","v":0},"Slim housing not with 7\", 10\", and 12\" fronts; without ATEX",null,null,null,null,null,null,4,null,"|","|","|",null,null,"Slim housing - without COM",null,{"$f":"IF($P$9=4,\"X\",\"\")","v":""}]
[null,null,null,null,null,null,null,null,null,null,null,"|","|","|"]
[null,null,null,null,null,null,null,null,null,null,null,"|","|","|",null,null,"Drive"]
[null,null,null,null,null,null,null,null,null,null,null,1,"|","|",null,null,"without drive",null,{"$f":"IF($P$10=1,\"X\",\"\")","v":"X"}]
[null,null,null,null,null,null,null," ",null,null,null,2,"|","|",null,null,"256 GB Eco SSD",null,{"$f":"IF($P$10=2,\"X\",\"\")","v":""}]
[null,null,null,null,null,null,null," ",null,null,null,3,"|","|",null,null,"240 GB SSD",null,{"$f":"IF($P$10=3,\"X\",\"\")","v":""}]
[null,null,null,null,null,null,null," ",null,null,null,4,"|","|",null,null,"480 GB SSD",null,{"$f":"IF($P$10=4,\"X\",\"\")","v":""}]
[null,null,null,null,null,null,null,null,null,null,null,null,"|","|"]
[null,null,null,null,null,null,null,null,null,null,null,null,"|","|",null,null,"Hardware extension"]
[null,null,null,null,null,null,null,null,null,null,null,null,"A","|",null,null,"without HW extension",null,{"$f":"IF($P$11=1,\"X\",\"\")","v":"X"}]
[null,null,null,null,null,null,null,null,null,null,null,null,"B","|",null,null,"NVRAM",null,{"$f":"IF($P$11=2,\"X\",\"\")","v":""}]
[null,null,null,null,null,null,null,null,null,null,null,null,null,"|"]
[null,null,null,null,null,null,null,null,null,null,null,null,null,"|",null,null,"Software configuration"]
[null,null,null,null,null,null,null,null,null,null,null,null,null,"A",null,null,"without Software",null,{"$f":"IF($P$12=1,\"X\",\"\")","v":"X"}]
[null,{"$f":"IF(AND(($P$12=2),($P$10=1)),1,0)","v":0},"Windows10 only with drive"," ",null,null,null," ",null,null,null,null,null,"B",null,null,"Windows 10 IoT Enterprise 2019 LTSC, 64Bit, MUI (Ger, En, Es, Fr, It)",null,{"$f":"IF($P$12=2,\"X\",\"\")","v":""}]
[null,{"$f":"IF(AND(($P$12=3),($P$10=1)),1,0)","v":0},"Windows10 only with drive"," ",null,null,null," ",null,null,null,null,null,"C",null,null,"Windows 10 IoT Enterprise 2021 LTSC, 64Bit, MUI (Ger, En, Es, Fr, It)",null,{"$f":"IF($P$12=3,\"X\",\"\")","v":""}]
[]
[]
[]
[null,null,null,null,null,null,null,null,null,null,null,null,null,null,null,null,"Base version",null,"X"]
[]
[{"$f":"A5","v":"6AV7"},{"$f":"B5","v":8},{"$f":"C5","v":8},{"$f":"D5","v":6}," - ",{"$f":"F5","v":0},"A","A","1","1","-","1","A","A",0,null,null,"Total:"]

{"sheet":"IPC277G PRO","index":24,"n_rows":77,"n_cols":19,"rows_kept":77,"cut":false,"hidden":false,"merged":[]}
["SIMATIC IPC277G PRO  (Nanopanel PC)"]
[]
[]
[null,null,null,null,null,null,null,null,null,null,null,null,null,null,null,null,{"$f":"IF(B67,C67,\"\")&IF(B68,C68,\"\")","v":""}]
["6AV7",8,8,6,"-",1,{"$f":"IF(P6=1,G19,)&IF(P6=2,G20,)&IF(P6=3,G21,)&IF(P6=4,G22,)&IF(P6=5,G23,)&IF(P6=6,G24,)&IF(P6=7,G25,)&IF(P6=8,G26,)&IF(P6=9,G27,)&IF(P6=10,G28,)&IF(P6=11,G29,)&IF(P6=12,G30,)&IF(P6=13,G31,)&IF(P6=14,G32,)&IF(P6=15,G33,)&IF(P6=16,G34,)&IF(P6=17,G35,)&IF(P6=18,G36,)","v":"A"},{"$f":"IF(P7=1,H39,)&IF(P7=2,H40,)&IF(P7=3,H41,)&IF(P7=4,H42,)&IF(P7=5,H43,)&IF(P7=6,H44,)","v":"A"},{"$f":"IF(P8=1,I47,)&IF(P8=2,I48,)&IF(P8=3,I49,)","v":"1"},{"$f":"IF(P9=1,J52,)&IF(P9=2,J53,)","v":"1"},"-",{"$f":"IF(P10=1,L56,)&IF(P10=2,L57,)&IF(P10=3,L58,)&IF(P10=4,L59,)","v":"1"},{"$f":"IF(P11=1,M62,)&IF(P11=2,M63,)","v":"A"},{"$f":"IF(P12=1,N66,)&IF(P12=2,N67,)&IF(P12=3,N68,)","v":"A"},0,null,{"$f":"\"SIMATIC IPC277G PRO (Nanopanel PC)\"","v":"SIMATIC IPC277G PRO (Nanopanel PC)"},{"$f":"$A$5&$B$5&$C$5&$D$5&$E$5&$F$5&$G$5&$H$5&$I$5&$J$5&$K$5&$L$5&$M$5&$N$5&$O$5","v":"6AV7886-1AA11-1AA0"}]
[null,null,null,null,null,null,null,"|","|","|",null,"|","|","|",null,1,{"$f":"IF(P6=1,Q19,)&IF(P6=2,Q20,)&IF(P6=3,Q21,)&IF(P6=4,Q22,)&IF(P6=5,Q23,)&IF(P6=6,Q24,)&IF(P6=7,Q25,)&IF(P6=8,Q26,)&IF(P6=9,Q27,)&IF(P6=10,Q28,)&IF(P6=11,Q29,)&IF(P6=12,Q30,)&IF(P6=13,Q31,)&IF(P6=14,Q32,)&IF(P6=15,Q33,)&IF(P6=16,Q34,)&IF(P6=17,Q35,)&IF(P6=18,Q36,)&IF(P6=19,Q37,)&IF(P6=20,Q38,)&IF(P6=21,Q39,)","v":"12\" Multitouch (1280 x 800) for support arm (not expandable, flange above)"}]
[null,null,null,null,null,null,null,"|","|","|",null,"|","|","|",null,1,{"$f":"IF(P7=1,Q39,)&IF(P7=2,Q40,)&IF(P7=3,Q41,)&IF(P7=4,Q42,)&IF(P7=5,Q43,)&IF(P7=6,Q44,)","v":"Atom X6413E (2-Core)"}]
[null,null,null,null,null,null,null,"|","|","|",null,"|","|","|",null,1,{"$f":"IF(P8=1,Q47,)&IF(P8=2,Q48,)&IF(P8=3,Q49,)","v":"4 GB RAM"},"Link utili"]
[null,null,null,null,null,null,null,"|","|","|",null,"|","|","|",null,1,{"$f":"IF(P9=1,Q52,)&IF(P9=2,Q53,)","v":"without COM"},"Certificati"]
[null,null,null,null,null,null,{"$f":"IF(P10=12,#REF!,IF(P10=13,#REF!,IF(P10=15,#REF!,IF(P10=16,#REF!,IF(P10=17,#REF!,\"\")))))","v":""},"|","|","|",null,"|","|","|",null,1,{"$f":"IF(P10=1,Q56,)&IF(P10=2,Q57,)&IF(P10=3,Q58,)&IF(P10=4,Q59,)","v":"without drive"},"Datasheet"]
[null,null,null,null,null,null,null,"|","|","|",null,"|","|","|",null,1,{"$f":"IF(P11=1,Q62,)&IF(P11=2,Q63,)","v":"without HW extension"},"Manuale"]
[null,null,null,null,null,null,null,"|","|","|",null,"|","|","|",null,1,{"$f":"IF(P12=1,Q66,)&IF(P12=2,Q67,)&IF(P12=3,Q68,)","v":"without Software"},"CAD 2D/3D"]
[null,null,null,null,null,null,null,"|","|","|",null,"|","|","|"]
[null,null,null,null,null,null,null,"|","|","|",null,"|","|","|"]
[null,null,null,null,null,null,null,"|","|","|",null,"|","|","|"]
[null,null,null,null,null,null,null,"|","|","|",null,"|","|","|"]
[null,null,null,null,null,null,null,"|","|","|",null,"|","|","|"]
[null,null,null,null,null,null,null,"|","|","|",null,"|","|","|",null,null,"Front Panel"]
[null,null,null,null,null,null,"A","|","|","|",null,"|","|","|",null,null,"12\" Multitouch (1280 x 800) for support arm (not expandable, flange above)",null,{"$f":"IF($P$6=1,\"X\",\"\")","v":"X"}]
[null,null,null,null,null,null,"B","|","|","|",null,"|","|","|",null,null,"12\" Multitouch (1280 x 800) for pedestal mounting (expandable, flange below)",null,{"$f":"IF($P$6=2,\"X\",\"\")","v":""}]
[null,null,null,null,null,null,"C","|","|","|",null,"|","|","|",null,null,"12\" Multitouch (1280 x 800) for support arm (expandable, round tube)",null,{"$f":"IF($P$6=3,\"X\",\"\")","v":""}]
[null,null,null,null,null,null,"D","|","|","|",null,"|","|","|",null,null,"15\" Multitouch (1920 x 1080) for support arm (not expandable, flange above)",null,{"$f":"IF($P$6=4,\"X\",\"\")","v":""}]
[null,null,null,null,null,null,"E","|","|","|",null,"|","|","|",null,null,"15\" Multitouch (1920 x 1080) for pedestal mounting (expandable, flange below)",null,{"$f":"IF($P$6=5,\"X\",\"\")","v":""}]
[null,null,null,null,null,null,"F","|","|","|",null,"|","|","|",null,null,"15\" Multitouch (1920 x 1080) for support arm (expandable, round tube)",null,{"$f":"IF($P$6=6,\"X\",\"\")","v":""}]
[null,null,null,null,null,null,"G","|","|","|",null,"|","|","|",null,null,"19\" Multitouch (1920 x 1080) for support arm (not expandable, flange above)",null,{"$f":"IF($P$6=7,\"X\",\"\")","v":""}]
[null,null,null,null,null,null,"H","|","|","|",null,"|","|","|",null,null,"19\" Multitouch (1920 x 1080) for pedestal mounting (expandable, flange below)",null,{"$f":"IF($P$6=8,\"X\",\"\")","v":""}]
[null,null,null,null,null,null,"J","|","|","|",null,"|","|","|",null,null,"19\" Multitouch (1920 x 1080) for support arm (expandable, round tube)",null,{"$f":"IF($P$6=9,\"X\",\"\")","v":""}]
[null,null,null,null,null,null,"K","|","|","|",null,"|","|","|",null,null,"12\" Multitouch neutral for support arm (not expandable, flange above)",null,{"$f":"IF($P$6=10,\"X\",\"\")","v":""}]
[null,null,null,null,null,null,"L","|","|","|",null,"|","|","|",null,null,"12\" Multitouch neutral for pedestal mounting (expandable, flange below)",null,{"$f":"IF($P$6=11,\"X\",\"\")","v":""}]
[null,null,null,null,null,null,"M","|","|","|",null,"|","|","|",null,null,"12\" Multitouch neutral for support arm (expandable, round tube)",null,{"$f":"IF($P$6=12,\"X\",\"\")","v":""}]
[null,null,null,null,null,null,"N","|","|","|",null,"|","|","|",null,null,"15\" Multitouch neutral for support arm (not expandable, flange above)",null,{"$f":"IF($P$6=13,\"X\",\"\")","v":""}]
[null,null,null,null,null,null,"P","|","|","|",null,"|","|","|",null,null,"15\" Multitouch neutral for pedestal mounting (expandable, flange below)",null,{"$f":"IF($P$6=14,\"X\",\"\")","v":""}]
[null,null,null,null,null,null,"Q","|","|","|",null,"|","|","|",null,null,"15\" Multitouch neutral for support arm (expandable, round tube)",null,{"$f":"IF($P$6=15,\"X\",\"\")","v":""}]
[null,null,null,null,null,null,"R","|","|","|",null,"|","|","|",null,null,"19\" Multitouch neutral for support arm (not expandable, flange above)",null,{"$f":"IF($P$6=16,\"X\",\"\")","v":""}]
[null,null,null,null,null,null,"S","|","|","|",null,"|","|","|",null,null,"19\" Multitouch neutral for pedestal mounting (expandable, flange below)",null,{"$f":"IF($P$6=17,\"X\",\"\")","v":""}]
[null,null,null,null,null,null,"T","|","|","|",null,"|","|","|",null,null,"19\" Multitouch neutral for support arm (expandable, round tube)",null,{"$f":"IF($P$6=18,\"X\",\"\")","v":""}]
[null,null,null,null,null,null,null,"|","|","|",null,"|","|","|"]
[null," ",null,null,null,null,null,"|","|","|",null,"|","|","|",null,null,"Processor / TPM"]
[null,null,null,null,null,null,null,"A","|","|",null,"|","|","|",null,null,"Atom X6413E (2-Core)",null,{"$f":"IF($P$7=1,\"X\",\"\")","v":"X"}]
[null,null,null,null,null,null,null,"B","|","|",null,"|","|","|",null,null,"Atom X6413E (4-Core)",null,{"$f":"IF($P$7=2,\"X\",\"\")","v":""}]
[null,null,null,null,null,null,null,"C","|","|",null,"|","|","|",null,null,"Atom X6414RE (4-Core)",null,{"$f":"IF($P$7=3,\"X\",\"\")","v":""}]
[null,null,null,null,null,null,null,"D","|","|",null,"|","|","|",null,null,"Atom X6413E (2-Core) / TPM",null,{"$f":"IF($P$7=4,\"X\",\"\")","v":""}]
[null,null,null,null,null," ",null,"E","|","|",null,"|","|","|",null,null,"Atom X6413E (4-Core) / TPM",null,{"$f":"IF($P$7=5,\"X\",\"\")","v":""}]
[null,null,null,null,null,null,null,"F","|","|",null,"|","|","|",null,null,"Atom X6414RE (4-Core) / TPM",null,{"$f":"IF($P$7=6,\"X\",\"\")","v":""}]
[null,null,null,null,null,null,null,null,"|","|",null,"|","|","|"]
[null,null,null,null,null,null,null,null,"|","|",null,"|","|","|",null,null,"RAM"]
[null,null,null,null,null,null,null,null,1,"|",null,"|","|","|",null,null,"4 GB RAM",null,{"$f":"IF($P$8=1,\"X\",\"\")","v":"X"}]
[null,null,null,null,null,null,null,null,2,"|",null,"|","|","|",null,null,"8 GB RAM",null,{"$f":"IF($P$8=2,\"X\",\"\")","v":""}]
[null,null,null,null,null,null,null,null,3,"|",null,"|","|","|",null,null,"16 GB RAM",null,{"$f":"IF($P$8=3,\"X\",\"\")","v":""}]
[null,null,null,null,null,null,null,null,null,"|",null,"|","|","|"]
[null,null,null,null,null,null,null,null,null,"|",null,"|","|","|",null,null,"Hardware configuration"]
[null,null,null,null,null,null,null,null,null,1,null,"|","|","|",null,null,"without COM",null,{"$f":"IF($P$9=1,\"X\",\"\")","v":"X"}]
[null,null,null,null,null,null,null,null,null,2,null,"|","|","|",null,null,"1x COM",null,{"$f":"IF($P$9=2,\"X\",\"\")","v":""}]
[null,null,null,null,null,null,null,null,null,null,null,"|","|","|"]
[null,null,null,null,null,null,null,null,null,null,null,"|","|","|",null,null,"Drive"]
[null,null,null,null,null,null,null,null,null,null,null,1,"|","|",null,null,"without drive",null,{"$f":"IF($P$10=1,\"X\",\"\")","v":"X"}]
[null,null,null,null,null,null,null," ",null,null,null,2,"|","|",null,null,"256 GB Eco SSD",null,{"$f":"IF($P$10=2,\"X\",\"\")","v":""}]
[null,null,null,null,null,null,null," ",null,null,null,3,"|","|",null,null,"240 GB SSD",null,{"$f":"IF($P$10=3,\"X\",\"\")","v":""}]
[null,null,null,null,null,null,null," ",null,null,null,4,"|","|",null,null,"480 GB SSD",null,{"$f":"IF($P$10=4,\"X\",\"\")","v":""}]
[null,null,null,null,null,null,null,null,null,null,null,null,"|","|"]
[null,null,null,null,null,null,null,null,null,null,null,null,"|","|",null,null,"Hardware extension"]
[null,null,null,null,null,null,null,null,null,null,null,null,"A","|",null,null,"without HW extension",null,{"$f":"IF($P$11=1,\"X\",\"\")","v":"X"}]
[null,null,null,null,null,null,null,null,null,null,null,null,"B","|",null,null,"NVRAM",null,{"$f":"IF($P$11=2,\"X\",\"\")","v":""}]
[null,null,null,null,null,null,null,null,null,null,null,null,null,"|"]
[null,null,null,null,null,null,null,null,null,null,null,null,null,"|",null,null,"Software configuration"]
[null,null,null,null,null,null,null,null,null,null,null,null,null,"A",null,null,"without Software",null,{"$f":"IF($P$12=1,\"X\",\"\")","v":"X"}]
[null,{"$f":"IF(AND(($P$12=2),($P$10=1)),1,0)","v":0},"Windows10 only with drive"," ",null,null,null," ",null,null,null,null,null,"B",null,null,"Windows 10 IoT Enterprise 2019 LTSC, 64Bit, MUI (Ger, En, Es, Fr, It)",null,{"$f":"IF($P$12=2,\"X\",\"\")","v":""}]
[null,{"$f":"IF(AND(($P$12=3),($P$10=1)),1,0)","v":0},"Windows10 only with drive"," ",null,null,null," ",null,null,null,null,null,"C",null,null,"Windows 10 IoT Enterprise 2021 LTSC, 64Bit, MUI (Ger, En, Es, Fr, It)",null,{"$f":"IF($P$12=3,\"X\",\"\")","v":""}]
[]
[]
[]
[null,null,null,null,null,null,null,null,null,null,null,null,null,null,null,null,"Base version",null,"X"]
[]
[{"$f":"A5","v":"6AV7"},{"$f":"B5","v":8},8,6," - ",{"$f":"F5","v":1},"A","A","1","1","-","1","A","A",0,null,null,"Total:"]
[]
[]
[null,null,null,null,null,null,null,null,null,null,null,null,null,null,null,null,"ACCESSORI PER IPC e MONITOR PRO"]

{"sheet":"IPC377G (Panel PC)","index":25,"n_rows":53,"n_cols":19,"rows_kept":53,"cut":false,"hidden":false,"merged":[]}
["SIMATIC IPC377G  ",null,null,null,null,null,null,null,null,null,null,null,null,null,null,null,{"$f":"IF(OR(($G$5=\"#\"),($H$5=\"#\"),($I$5=\"#\"),($J$5=\"#\"),($L$5=\"#\"),($M$5=\"#\")),#REF!,\"\")","v":""}]
[]
[]
[]
["6AV7",2,3,1,"-",0,{"$f":"IF(P6=1,G19,)&IF(P6=2,G20,)&IF(P6=3,G21,)&IF(P6=4,G22,)&IF(P6=5,#REF!,)&IF(P6=6,#REF!,)&IF(P6=7,#REF!,)&IF(P6=8,#REF!,)&IF(P6=9,#REF!,)&IF(P6=10,#REF!,)&IF(P6=11,#REF!,)&IF(P6=12,#REF!,)&IF(P6=13,#REF!,)&IF(P6=14,#REF!,)&IF(P6=15,#REF!,)&IF(P6=16,#REF!,)&IF(P6=17,#REF!,)&IF(P6=18,#REF!,)&IF(P6=19,#REF!,)&IF(P6=20,#REF!,)&IF(P6=21,#REF!,)&IF(P6=22,#REF!,)&IF(P6=23,#REF!,)&IF(P6=24,#REF!,)&IF(P6=25,#REF!,)&IF(P6=26,#REF!,)&IF(P6=27,#REF!,)&IF(P6=28,#REF!,)&IF(P6=29,#REF!,)&IF(P6=30,#REF!,)&IF(P6=31,#REF!,)&IF(P6=32,#REF!,)&IF(P6=33,#REF!,)","v":"C"},{"$f":"IF(P7=1,H25,)&IF(P7=2,H26,)&IF(P7=3,H27,)&IF(P7=4,H28,)&IF(P7=5,#REF!,)&IF(P7=6,#REF!,)","v":"A"},{"$f":"IF(P8=1,I31,)&IF(P8=2,I32,)&IF(P8=3,I33,)","v":"2"},{"$f":"IF(P9=1,J36,)&IF(P9=2,J37,)&IF(P9=3,#REF!,)","v":"1"},"-",{"$f":"IF(P10=1,L40,)&IF(P10=2,L41,)&IF(P10=3,#REF!,)&IF(P10=4,#REF!,)","v":"0"},{"$f":"IF(P11=1,M44,)&IF(P11=2,M45,)&IF(P11=3,M46,)&IF(P11=4,#REF!,)","v":"A"},{"$f":"IF(P12=1,N49,)&IF(P12=2,#REF!,)&IF(P12=3,#REF!,)&IF(P12=4,#REF!,)&IF(P12=5,#REF!,)","v":"A"},0,null,"IPC377G",{"$f":"$A$5&$B$5&$C$5&$D$5&$E$5&$F$5&$G$5&$H$5&$I$5&$J$5&$K$5&$L$5&$M$5&$N$5&$O$5","v":"6AV7231-0CA21-0AA0"}]
[null,null,null,null,null,null,"|","|","|","|",null,"|","|","|",null,1,{"$f":"IF(P6=1,Q19,)&IF(P6=2,Q20,)&IF(P6=3,Q21,)&IF(P6=4,Q22,)&IF(P6=5,#REF!,)&IF(P6=6,#REF!,)&IF(P6=7,#REF!,)&IF(P6=8,#REF!,)&IF(P6=9,#REF!,)&IF(P6=10,#REF!,)&IF(P6=11,#REF!,)&IF(P6=12,#REF!,)&IF(P6=13,#REF!,)&IF(P6=14,#REF!,)&IF(P6=15,#REF!,)&IF(P6=16,#REF!,)&IF(P6=17,#REF!,)&IF(P6=18,#REF!,)&IF(P6=19,#REF!,)&IF(P6=20,#REF!,)&IF(P6=21,#REF!,)&IF(P6=22,#REF!,)&IF(P6=23,#REF!,)&IF(P6=24,#REF!,)&IF(P6=25,#REF!,)&IF(P6=26,#REF!,)&IF(P6=27,#REF!,)&IF(P6=28,#REF!,)&IF(P6=29,#REF!,)&IF(P6=30,#REF!,)&IF(P6=31,#REF!,)&IF(P6=32,#REF!,)&IF(P6=33,#REF!,)","v":"12” Touch(1280 x800)"}]
[null,null,null,null,null,null,"|","|","|","|",null,"|","|","|",null,1,{"$f":"IF(P7=1,Q25,)&IF(P7=2,Q26,)&IF(P7=3,Q27,)&IF(P7=4,Q28,)&IF(P7=5,#REF!,)&IF(P7=6,#REF!,)&IF(P7=7,#REF!,)","v":"Intel Atomx6413E Processor (up to 3.0 GHz)"}]
[null,null,null,null,null,null,"|","|","|","|",null,"|","|","|",null,1,{"$f":"IF(P8=1,Q31,)&IF(P8=2,Q32,)&IF(P8=3,Q33,)","v":"4GB RAM"},"Link utili"]
[null,null,null,null,null,null,"|","|","|","|",null,"|","|","|",null,1,{"$f":"IF(P9=1,Q36,)&IF(P9=2,Q37,)&IF(P9=3,#REF!,)","v":"4USB+2COM"},"Certificati"]
[null,null,null,null,null,null,"|","|","|","|",null,"|","|","|",null,1,{"$f":"IF(P10=1,Q40,)&IF(P10=2,Q41,)&IF(P10=3,#REF!,)&IF(P10=4,#REF!,)","v":"without Software"},"Datasheet"]
[null,null,null,null,null,null,"|","|","|","|",null,"|","|","|",null,1,{"$f":"IF(P11=1,Q44,)&IF(P11=2,Q45,)&IF(P11=3,Q46,)&IF(P11=4,#REF!,)","v":"without mass storage"},"Manuale"]
[null,null,null,null,null,null,"|","|","|","|",null,"|","|","|",null,1,{"$f":"IF(P12=1,Q49,)&IF(P12=2,#REF!,)&IF(P12=3,#REF!,)&IF(P12=4,#REF!,)&IF(P12=5,#REF!,)","v":"Reserve"},"CAD 2D/3D"]
[null,null,null,null,null,null,"|","|","|","|",null,"|","|","|"]
[null,null,null,null,null,null,"|","|","|","|",null,"|","|","|"]
[null,null,null,null,null,null,"|","|","|","|",null,"|","|","|"]
[null,null,null,null,null,null,"|","|","|","|",null,"|","|","|"]
[null,null,null,null,null,null,"|","|","|","|",null,"|","|","|"]
[null,null,null,null,null,null,"|","|","|","|",null,"|","|","|",null,null,"Display"]
[null,null,null,null,null,null,"C","|","|","|",null,"|","|","|",null,null,"12” Touch(1280 x800)",null,{"$f":"IF($P$6=1,1,\"\")","v":1}]
[null,null,null,null,null,null,"D","|","|","|",null,"|","|","|",null,null,"15“ Touch(1366 x768)",null,{"$f":"IF($P$6=2,1,\"\")","v":""}]
[null,null,null,null,null,null,"E","|","|","|",null,"|","|","|",null,null,"19” Touch(1366 x768)",null,{"$f":"IF($P$6=3,1,\"\")","v":""}]
[null,null,null,null,null,null,"F","|","|","|",null,"|","|","|",null,null,"22“ Touch(1920 x1080)",null,{"$f":"IF($P$6=4,1,\"\")","v":""}]
[null,null,null,null,null,null,null,"|","|","|",null,"|","|","|"]
[null," ",null,null,null,null,null,"|","|","|",null,"|","|","|",null,null,"CPU"]
[null,null,null,null,null,null,null,"A","|","|",null,"|","|","|",null,null,"Intel Atomx6413E Processor (up to 3.0 GHz)",null,{"$f":"IF($P$7=1,1,\"\")","v":1}]
[null,null,null,null,null,null,null,"B","|","|",null,"|","|","|",null,null,"Intel Atomx6413E Processor (up to 3.0 GHz)/TPM",null,{"$f":"IF($P$7=2,1,\"\")","v":""}]
[null,null,null,null,null,null,null,"C","|","|",null,"|","|","|",null,null,"Intel Atomx6413E Processor (up to 3.0 GHz)/w/o Audio",null,{"$f":"IF($P$7=3,1,\"\")","v":""}]
[null,null,null,null,null,null,null,"D","|","|",null,"|","|","|",null,null,"Intel Atomx6413E Processor (up to 3.0 GHz)/TPM/w/o Audio",null,{"$f":"IF($P$7=4,1,\"\")","v":""}]
[null,null,null,null,null,null,null,null,"|","|",null,"|","|","|"]
[null,null,null,null,null,null,null,null,"|","|",null,"|","|","|",null,null,"Memory"]
[null,null,null,null,null,null,null,null,2,"|",null,"|","|","|",null,null,"4GB RAM",null,{"$f":"IF($P$8=1,1,\"\")","v":1}]
[null,null,null,null,null,null,null,null,3,"|",null,"|","|","|",null,null,"8GB RAM",null,{"$f":"IF($P$8=2,1,\"\")","v":""}]
[null,null,null,null,null,null,null,null,4,"|",null,"|","|","|",null,null,"16GB RAM",null,{"$f":"IF($P$8=3,1,\"\")","v":""}]
[null,null,null,null,null,null,null,null,null,"|",null,"|","|","|"]
[null,null,null,null,null,null,null,null,null,"|",null,"|","|","|",null,null,"HW extension"]
[null,null,null,null,null,null,null,null,null,1,null,"|","|","|",null,null,"4USB+2COM",null,{"$f":"IF($P$9=1,1,\"\")","v":1}]
[null,null,null,null,null,null,null,null,null,2,null,"|","|","|",null,null,"4USB+4COM via pinheader",null,{"$f":"IF($P$9=2,1,\"\")","v":""}]
[null,null,null,null,null,null,null,null,null,null,null,"|","|","|"]
[null,null,null,null,null,null,null,null,null,null,null,"|","|","|",null,null,"OS"]
[null,null,null,null,null,null,null,null,null,null,null,0,"|","|",null,null,"without Software",null,{"$f":"IF($P$10=1,1,\"\")","v":1}]
[null,{"$f":"IF(AND(P10=2,P11=1),1,0)","v":0},"Windows10 only with drive",null,null,null,null," ",null,null,null,{"$f":"IF(OR($P$11=1),\"#\",\"2\")","v":"#"},"|","|",null,null,"Windows 10 Enterprise LTSC 2019, 64Bit, MUI (De, En, Fr, It, Sp)",null,{"$f":"IF($P$10=2,1,\"\")","v":""}]
[null,null,null,null,null,null,null,null,null,null,null,null,"|","|"]
[null,null,null,null,null,null,null,null,null,null,null,null,"|","|",null,null,"Mass storage"]
[null,null,null,null,null,null,null,null,null,null,null,null,"A","|",null,null,"without mass storage",null,{"$f":"IF($P$11=1,1,\"\")","v":1}]
[null,null,null,null,null,null,null,null,null,null,null,null,"B","|",null,null,"256G SSD",null,{"$f":"IF($P$11=2,1,\"\")","v":""}]
[null,null,null,null,null,null,null,null,null,null,null,null,"C","|",null,null,"512G SSD",null,{"$f":"IF($P$11=3,1,\"\")","v":""}]
[null,null,null,null,null,null,null,null,null,null,null,null,null,"|"]
[null,null,null,null,null,null,null,null,null,null,null,null,null,"|"]
[null,null,null,null,null,null,null,null,null,null,null,null,null,"A",null,null,"Reserve",null,{"$f":"IF($P$12=1,1,\"\")","v":1}]
[null,null,null,null,null,null,null,null,null,null,null,null,null,null,null,null,"Base MLFB: 6AV7231-0CC21-0AA0",null,1]
[null,null,null,null,null,null,null,null,null,null,null,null,null,null,null,null,"Listino"]
[]
[{"$f":"A5","v":"6AV7"},{"$f":"B5","v":2},{"$f":"C5","v":3},{"$f":"D5","v":1}," - ",{"$f":"F5","v":0},"C","A","2","1","-","0","A","A",0]

{"sheet":"IPC477E (Panel PC)","index":26,"n_rows":115,"n_cols":21,"rows_kept":115,"cut":false,"hidden":false,"merged":[[0,17,3,17]]}
["SIMATIC IPC477E (Panel PC)",null,null,null,null,null,null,null,null,null,null,null,null,null,null,null,"IPC superato da IPC PX-39A - IPC PX-32A",null,null,null,"."]
[null,null,null,null,null,null,null,null,null,null,null,null,null,null,null,null,{"$f":"$A$5&$B$5&$C$5&$D$5&$E$5&$F$5&$G$5&$H$5&$I$5&$J$5&$K$5&$L$5&$M$5&$N$5&$O$5","v":"6AV7241-1BA00-0AA0"}]
[null,null,{"$f":"IF(OR(F5=\"#\",G5=\"#\",H5=\"#\",I5=\"#\",J5=\"#\",L5=\"#\",M5=\"#\",N5=\"#\",O5=\"#\"),1,0)","v":0},"Configuration not possible. Mind the combinations of the options",null,null,null,null,null,null,null,null,null,null,null," ",{"$f":"IF(C3,D3,\"\")","v":""}]
[" ",null,null,null,null,null,null,null,null,null,null,null,null,null,null,null," "]
["6AV7",2,4,1,"-",{"$f":"VLOOKUP(P7,A21:Q24,6,TRUE)","v":1},{"$f":"VLOOKUP(P8,A27:Q41,7,TRUE)","v":"B"},{"$f":"VLOOKUP(P9,A44:Q53,8,TRUE)","v":"A"},{"$f":"VLOOKUP(P10,A56:Q63,9,TRUE)","v":0},{"$f":"VLOOKUP(P11,A66:Q74,10,TRUE)","v":0},"-",{"$f":"VLOOKUP(P12,A77:Q82,12,FALSE)","v":0},{"$f":"VLOOKUP(P13,A85:Q89,13,TRUE)","v":"A"},{"$f":"VLOOKUP(P14,A92:Q92,14,TRUE)","v":"A"},{"$f":"VLOOKUP(P15,A95:Q100,15,TRUE)","v":0},null,{"$f":" \"SIMATIC IPC477E\" & \" (Panel PC)\"","v":"SIMATIC IPC477E (Panel PC)"},{"$f":"T(Q2)","v":"6AV7241-1BA00-0AA0"}]
[null,null,null,"|",null,"|","|","|","|","|",null,"|","|","|","|",1,{"$f":"VLOOKUP(P6,A18:Q18,17,FALSE)","v":"Standard-Device"}]
[null,null,null,"|",null,"|","|","|","|","|",null,"|","|","|","|",1,{"$f":"VLOOKUP(P7,A21:Q24,17,FALSE)","v":"Celeron G3902E; 3x Gigabit Ethernet (IE/PN)"}," "]
[null,null,null,"|",null,"|","|","|","|","|",null,"|","|","|","|",1,{"$f":"VLOOKUP(P8,A27:Q41,17,FALSE)","v":"15\" Singletouch (1280 x 800) with Front-USB"}]
[null,null,null,"|",null,"|","|","|","|","|",null,"|","|","|","|",1,{"$f":"VLOOKUP(P9,A44:Q53,17,FALSE)","v":"4GB"}]
[null,null,null,"|",null,"|","|","|","|","|",null,"|","|","|","|",1,{"$f":"VLOOKUP(P10,A56:Q63,17,FALSE)","v":"no RS232/485, without PCIe"}]
[null,null,null,"|",null,"|","|","|","|","|",null,"|","|","|","|",1,{"$f":"VLOOKUP(P11,A66:Q74,17,FALSE)","v":"without Windows Operating system"},"Link utili"]
[null,null,null,"|",null,"|","|","|","|","|",null,"|","|","|","|",1,{"$f":"VLOOKUP(P12,A77:Q82,17,FALSE)","v":"without external mass storage"},"Certificati"]
[null,null,null,"|",null,"|","|","|","|","|",null,"|","|","|","|",1,{"$f":"VLOOKUP(P13,A85:Q89,17,FALSE)","v":"without internal mass storage"},"Datasheet"]
[null,null,null,"|",null,"|","|","|","|","|",null,"|","|","|","|",1,{"$f":"VLOOKUP(P14,A92:Q92,17,FALSE)","v":"without SIMATIC Software"},"Manuale"]
[null,null,null,"|",null,"|","|","|","|","|",null,"|","|","|","|",1,{"$f":"VLOOKUP(P15,A95:Q100,17,FALSE)","v":"24V DC Industry power supply"},"CAD 2D/3D"]
[null,null,null,"|",null,"|","|","|","|","|",null,"|","|","|","|",null," "]
[null,null,null,"|",null,"|","|","|","|","|",null,"|","|","|","|",null,"Building Type"]
[1,null,null,1,null,"|","|","|","|","|",null,"|","|","|","|",null,"Standard-Device",null,{"$f":"IF($P$6=1,1,\"\")","v":1}]
[null,null,null,null,null,"|","|","|","|","|",null,"|","|","|","|"]
[null,null,null,null,null,"|","|","|","|","|",null,"|","|","|","|",null,"Processor and Fieldbus"]
[1,null,null,null,null,1,"|","|","|","|",null,"|","|","|","|",null,"Celeron G3902E; 3x Gigabit Ethernet (IE/PN)",null,{"$f":"IF($P$7=1,1,\"\")","v":1}]
[2,null,null,null,null,3,"|","|","|","|",null,"|","|","|","|",null,"Core i3-6102E; 3x Gigabit Ethernet (IE/PN)",null,{"$f":"IF($P$7=2,1,\"\")","v":""}]
[3,null,null,null,null,5,"|","|","|","|",null,"|","|","|","|",null,"Core i5-6442EQ; 3x Gigabit Ethernet (IE/PN);",null,{"$f":"IF($P$7=3,1,\"\")","v":""}]
[4,null,null,null,null,7,"|","|","|","|",null,"|","|","|","|",null,"XEON E3-1505L; 3x Gigabit Ethernet (IE/PN)",null,{"$f":"IF($P$7=4,1,\"\")","v":""}]
[null,null,null,null,null,null,"|","|","|","|",null,"|","|","|","|"]
[null,null,null,null,null,null,"|","|","|","|",null,"|","|","|","|",null,"Frontpanel"]
[1,null,null,null,null,null,"B","|","|","|",null,"|","|","|","|",null,"15\" Singletouch (1280 x 800) with Front-USB",null,{"$f":"IF($P$8=1,1,\"\")","v":1}]
[2,null,null,null,null,null,"D","|","|","|",null,"|","|","|","|",null,"19\" Singletouch (1366 x 768) with Front-USB",null,{"$f":"IF($P$8=2,1,\"\")","v":""}]
[3,null,null,null,null,null,"E","|","|","|",null,"|","|","|","|",null,"22\" Singletouch (1920 x 1080) with Front-USB",null,{"$f":"IF($P$8=3,1,\"\")","v":""}]
[4,null,null,null,null,null,"G","|","|","|",null,"|","|","|","|",null,"19\" Multitouch (1920 x 1080; with WES7-E only ST-mode)",null,{"$f":"IF($P$8=4,1,\"\")","v":""}]
[5,null,null,null,null,null,"J","|","|","|",null,"|","|","|","|",null,"15\" Multitouch (1366 x 768; with WES7-E only ST-mode)",null,{"$f":"IF($P$8=5,1,\"\")","v":""}]
[6,null,null,null,null,null,"K","|","|","|",null,"|","|","|","|",null,"19\" Multitouch (1366 x 768; with WES7-E only ST-mode)",null,{"$f":"IF($P$8=6,1,\"\")","v":""}]
[7,null,null,null,null,null,"L","|","|","|",null,"|","|","|","|",null,"22\" Multitouch (1920 x 1080; with WES7-E only ST-mode)",null,{"$f":"IF($P$8=7,1,\"\")","v":""}]
[8,null,null,null,null,null,"R","|","|","|",null,"|","|","|","|",null,"24\" Multitouch (1920 x 1080; with WES7-E only ST-mode)",null,{"$f":"IF($P$8=8,1,\"\")","v":""}]
[9,null,null,null,null,null,"S","|","|","|",null,"|","|","|","|",null,"24\" Multitouch (1920 x 1080) Neutral Panel (with WES7-E only ST-mode)",null,{"$f":"IF($P$8=9,1,\"\")","v":""}]
[10,null,null,null,null,null,"T","|","|","|",null,"|","|","|","|",null,"15\" Singletouch (1280 x 800), Neutral Panel with Front-USB",null,{"$f":"IF($P$8=10,1,\"\")","v":""}]
[11,null,null,null,null,null,"U","|","|","|",null,"|","|","|","|",null,"19\" Singletouch (1280 x 800), Neutral Panel with Front-USB",null,{"$f":"IF($P$8=11,1,\"\")","v":""}]
[12,null,null,null,null,null,"V","|","|","|",null,"|","|","|","|",null,"22\" Singletouch (1280 x 800), Neutral Panel with Front-USB",null,{"$f":"IF($P$8=12,1,\"\")","v":""}]
[13,null,null,null,null,null,"W","|","|","|",null,"|","|","|","|",null,"15\" Multitouch (1366 x 768) Neutral Panel (with WES7-E only ST-mode)",null,{"$f":"IF($P$8=13,1,\"\")","v":""}]
[14,null,null,null,null,null,"X","|","|","|",null,"|","|","|","|",null,"19\" Multitouch (1366 x 768) Neutral Panel (with WES7-E only ST-mode)",null,{"$f":"IF($P$8=14,1,\"\")","v":""}]
[15,null,null,null,null,null,"Y","|","|","|",null,"|","|","|","|",null,"22\" Multitouch (1920 x 1080) Neutral Panel (with WES7-E only ST-mode)",null,{"$f":"IF($P$8=15,1,\"\")","v":""}]
[null,null,null,null,null,null,null,"|","|","|",null,"|","|","|","|"]
[null,null,null,null,null,null," ","|","|","|",null,"|","|","|","|",null,"Ram/NVRAM"]
[1,null,null,null,null,null,null,"A","|","|",null,"|","|","|","|",null,"4GB",null,{"$f":"IF($P$9=1,1,\"\")","v":1}]
[2,null,null,null,null,null,null,"B","|","|",null,"|","|","|","|",null,"8GB",null,{"$f":"IF($P$9=2,1,\"\")","v":""}]
[3,null,null,null,null,null,null,"C","|","|",null,"|","|","|","|",null,"16GB",null,{"$f":"IF($P$9=3,1,\"\")","v":""}]
[4,null,null,null,null,null,null,{"$f":"IF($P$7<>3,\"D\",\"#\")","v":"D"},"|","|",null,"|","|","|","|",null,"8GB with ECC",null,{"$f":"IF($P$9=4,1,\"\")","v":""}]
[5,null,null,null,null,null,null,{"$f":"IF($P$7<>3,\"E\",\"#\")","v":"E"},"|","|",null,"|","|","|","|",null,"16GB with ECC",null,{"$f":"IF($P$9=5,1,\"\")","v":""}]
[6,null,{"$f":"IF(AND($P$6<>7,P10=5),1,0)","v":0},"Arbeitsspeicher mit ECC nur in Verbindung mit Core i7 mit IE/PN (Option \"6\")",".",null,null,"F","|","|",null,"|","|","|","|",null,"4GB and NVRAM",null,{"$f":"IF($P$9=6,1,\"\")","v":""}]
[7,null,{"$f":"IF(AND($P$6<>7,P11=5),1,0)","v":0},"Arbeitsspeicher mit ECC nur in Verbindung mit Core i7 mit IE/PN (Option \"6\")",".",null,null,"G","|","|",null,"|","|","|","|",null,"8GB and NVRAM",null,{"$f":"IF($P$9=7,1,\"\")","v":""}]
[8,null,{"$f":"IF(AND($P$6<>7,P12=5),1,0)","v":0},"Arbeitsspeicher mit ECC nur in Verbindung mit Core i7 mit IE/PN (Option \"6\")",".",null,null,"H","|","|",null,"|","|","|","|",null,"16GB and NVRAM",null,{"$f":"IF($P$9=8,1,\"\")","v":""}]
[9,null,{"$f":"IF(AND($P$6<>7,P14=5),1,0)","v":0},"Arbeitsspeicher mit ECC nur in Verbindung mit Core i7 mit IE/PN (Option \"6\")",".",null,null,{"$f":"IF($P$7<>3,\"J\",\"#\")","v":"J"},"|","|",null,"|","|","|","|",null,"8GB with ECC and NVRAM",null,{"$f":"IF($P$9=9,1,\"\")","v":""}]
[10,null,{"$f":"IF(AND($P$6<>7,P15=5),1,0)","v":0},"Arbeitsspeicher mit ECC nur in Verbindung mit Core i7 mit IE/PN (Option \"6\")",".",null,null,{"$f":"IF($P$7<>3,\"K\",\"#\")","v":"K"},"|","|",null,"|","|","|","|",null,"16GB with ECC and NVRAM",null,{"$f":"IF($P$9=10,1,\"\")","v":""}]
[null,null,null,null,null,null,null,null,"|","|",null,"|","|","|","|",null," "]
[null,null,null,null,null,null,null,null,"|","|",null,"|","|","|","|",null,"Extension (HW)"]
[1,null,null,null,null,null,null,null,0,"|",null,"|","|","|","|",null,"no RS232/485, without PCIe",null,{"$f":"IF($P$10=1,1,\"\")","v":1}]
[2," ",{"$f":"IF(OR($P$8=1),1,0)","v":1},"restrictions with 12\"; not expandable, no AC-Power supply, no DVD, no HDD, not second RS232"," ",null,null,null,"1","|",null,"|","|","|","|",null,"no RS232/485 and one PCIe",null,{"$f":"IF($P$10=2,1,\"\")","v":""}]
[3,null,{"$f":"IF(OR($P$8=1),1,0)","v":1},"restrictions with 12\"; not expandable, no AC-Power supply, no DVD, no HDD, not second RS232",null,null,null,null,"3","|",null,"|","|","|","|",null,"two RS232/485 and without PCIe",null,{"$f":"IF($P$10=3,1,\"\")","v":""}]
[4,null,{"$f":"IF(OR($P$8=1),1,0)","v":1},"restrictions with 12\"; not expandable, no AC-Power supply, no DVD, no HDD, not second RS232"," ",null,null,null,"4","|",null,"|","|","|","|",null,"two RS232/485 and one PCIe",null,{"$f":"IF($P$10=4,1,\"\")","v":""}]
[5,null,null,null,null,null,null,null,{"$f":"IF(OR($P$8<4,$P$8=9,$P$8=10,$P$8=11,$P$8=12,$P$13=5,$P$15=2,$P$15=3,$P$15=4,$P$15=5,),\"#\",\"5\")","v":"#"},"|",null,"|","|","|","|",null,"no RS232 without PCIe with ATEX/IECEx",null,{"$f":"IF($P$10=5,1,\"\")","v":""}]
[6,null,null,null,null,null,null,null,{"$f":"IF(OR($P$8<4,$P$8=9,$P$8=10,$P$8=11,$P$8=12,$P$13=5,$P$15=2,$P$15=3,$P$15=4,$P$15=5,),\"#\",\"6\")","v":"#"},"|",null,"|","|","|","|",null,"no RS232 with PCIe with ATEX/IECEx",null,{"$f":"IF($P$10=6,1,\"\")","v":""}]
[7,null,null,null,null,null,null,null,{"$f":"IF(OR($P$8<4,$P$8=9,$P$8=10,$P$8=11,$P$8=12,$P$13=5,$P$15=2,$P$15=3,$P$15=4,$P$15=5,),\"#\",\"7\")","v":"#"},"|",null,"|","|","|","|",null,"two RS232 without PCIe with ATEX/IECEx",null,{"$f":"IF($P$10=7,1,\"\")","v":""}]
[8,null,null,null,null,null,null,null,{"$f":"IF(OR($P$8<4,$P$8=9,$P$8=10,$P$8=11,$P$8=12,$P$13=5,$P$15=2,$P$15=3,$P$15=4,$P$15=5,),\"#\",\"8\")","v":"#"},"|",null,"|","|","|","|",null,"two RS232 with PCIe with ATEX/IECEx",null,{"$f":"IF($P$10=8,1,\"\")","v":""}]
[null,null,null,null,null,null,null,null,null,"|",null,"|","|","|","|"]
[null,null,null,null,null,null,null,null,null,"|",null,"|","|","|","|",null,"Operating system"]
[1,null,null,null,null,null,null,null,null,0,null,"|","|","|","|",null,"without Windows Operating system",null,{"$f":"IF($P$11=1,1,\"\")","v":1}]
[2,null,{"$f":"IF(OR($P$13<3,$P$13=1,$P$13=2,$P$13=8,$P$13=9,$P$13=12)*OR($P$12<3,$P$12>5),1,0)","v":1},null,null,null,null,null,null,1,null,"|","|","|","|",null,"Windows Embedded Standard 7 E SP1, englisch, 32Bit",null,{"$f":"IF($P$11=2,1,\"\")","v":""}]
[3,null,{"$f":"IF(OR($P$13<3,$P$13=1,$P$13=2,$P$13=8,$P$13=9,$P$13=12)*OR($P$12<3,$P$12>5),1,0)","v":1},null,null,null,null,null,null,2,null,"|","|","|","|",null,"Windows Embedded Standard 7 E SP1, englisch, 64Bit",null,{"$f":"IF($P$11=3,1,\"\")","v":""}]
[4,null,{"$f":"IF(AND($P$11>2,OR($P$13<6,$P$13=9)),1,0)","v":0},null,null,null,null,null,null,3,null,"|","|","|","|",null,"Windows Embedded Standard 7 P SP1, MUI, 64Bit, Multitouch",null,{"$f":"IF($P$11=4,1,\"\")","v":""}]
[5,null,{"$f":"IF(AND($P$11>2,OR($P$13<6,$P$13=9)),1,0)","v":0},null,null,null,null,null,null,4,null,"|","|","|","|",null,"Windows7 Ultimate SP1, 64Bit, MUI (de, en, es, fr, it)",null,{"$f":"IF($P$11=5,1,\"\")","v":""}]
[6,null,null,null,null,null,null,null,null,{"$f":"IF($P$7<>4,\"5\",\"#\")","v":"5"},null,"|","|","|","|",null,"Windows 10 IoT Enterprise 2019 LTSC (64Bit) for Processors Celeron, i3 and i5",null,{"$f":"IF($P$11=6,1,\"\")","v":""}]
[7,null,null,null,null,null,null,null,null,{"$f":"IF($P$7=4,\"6\",\"#\")","v":"#"},null,"|","|","|","|",null,"Windows 10 IoT Enterprise 2019 LTSC (64Bit) for Processor Xeon",null,{"$f":"IF($P$11=7,1,\"\")","v":""}]
[8,null," "," ",".",null,null,null,null,{"$f":"IF($P$7<>4,\"7\",\"#\")","v":"7"},null,"|","|","|","|",null,"Windows 10 Enterprise 2016 LTSB (64Bit) for Processors Celeron, i3 and i5",null,{"$f":"IF($P$11=8,1,\"\")","v":""}]
[9,null," "," ",".",null,null,null,null,{"$f":"IF($P$7=4,\"8\",\"#\")","v":"#"},null,"|","|","|","|",null,"Windows 10 Enterprise 2016 LTSB (64Bit) for Processor Xeon",null,{"$f":"IF($P$11=9,1,\"\")","v":""}]
[" ",null,null,null,null,null,null,null,null,null,null,"|","|","|","|"]
[null,null,null,null,null,null,null,null,null,null,null,"|","|","|","|",null,"Drive changeable (accessible)"]
[1,null,null,null,null,null,null,null,null,null,null,0,"|","|","|",null,"without external mass storage",null,{"$f":"IF($P$12=1,1,\"\")","v":1}]
[2,null,null,null,null,null,null,null,null,null,null,1,"|","|","|",null,"CFAST 2GB, without Operating system",null,{"$f":"IF($P$12=2,1,\"\")","v":""}]
[3,null,null,null,null,null,null,null,null,null,null,2,"|","|","|",null,"CFAST 4GB (only optional with operating system/SW, if no internal mass storage or HDD)",null,{"$f":"IF($P$12=3,1,\"\")","v":""}]
[4,null,null,null,null,null,null,null,null,null,null,3,"|","|","|",null,"CFAST 8GB (only optional with operating system/SW, if no internal mass storage or HDD)",null,{"$f":"IF($P$12=4,1,\"\")","v":""}]
[5,null,null,null,null,null,null,null,null,null,null,4,"|","|","|",null,"CFAST 16GB (only optional with operating system/SW, if no internal mass storage or HDD)",null,{"$f":"IF($P$12=5,1,\"\")","v":""}]
[6,null,null,null,null,null,null,null,null,null,null,5,"|","|","|",null,"CFAST 128GB (only optional with operating system/SW, if no internal mass storage)",null,{"$f":"IF($P$12=6,1,\"\")","v":""}]
[null,null,null,null,null,null,null,null,null,null,null,null,"|","|","|"]
[null,null,null,null,null,null," ",null,null,null,null,null,"|","|","|",null,"Drive internal (not accessible)"]
[1,null,null,null,null,null,null,null,null,null," ",null,{"$f":"IF(OR(AND($P$11=2,$P$12>3),AND($P$11=3,$P$12>4),AND($P$11=4,$P$12>4),AND($P$11>5,$P$12=6),$P$11=1),\"A\",\"#\")","v":"A"},"|","|",null,"without internal mass storage",null,{"$f":"IF($P$13=1,1,\"\")","v":1}]
[2,null,null,null,null,null,null,null,null,null,null,null,"D","|","|",null,"256 GB Eco SSD",null,{"$f":"IF($P$13=2,1,\"\")","v":""}]
[3,null,null,null,null,null,null,null,null,null,null,null,"F","|","|",null,"240 GB SSD",null,{"$f":"IF($P$13=3,1,\"\")","v":""}]
[4,null,null,null,null,null,null,null,null,null,null,null,"G","|","|",null,"480 GB SSD",null,{"$f":"IF($P$13=4,1,\"\")","v":""}]
[5,null,null,null,null,null,null,null,null,null,null,null,"J","|","|",null,"HDD 320GB",null,{"$f":"IF($P$13=5,1,\"\")","v":""}]
[null,null,null,null,null,null,null,null,null,null,null,null,null,"|","|"]
[null,null,null,null,null,null,null,null,null,null,null,null,null,"|","|",null,"Software Configuration preinstalled (Bundles)"]
[1,null,null,null,null,null," "," "," "," "," "," "," ","A","|",null,"without SIMATIC Software",null,{"$f":"IF($P$14=1,1,\"\")","v":1}]
[null,null,null,null,null,null," "," "," "," "," "," "," "," ","|"," ",null,null," "]
[null,null,null,null,null,null," "," "," "," "," "," "," ",null,"|",null,"Power supply"]
[1,null,null,null,null,null,null,null,null,null,null,null,null,null,0,null,"24V DC Industry power supply",null,{"$f":"IF($P$15=1,1,\"\")","v":1}]
[2,null,{"$f":"IF(OR($P$8=1),1,0)","v":1},"restrictions with 12\"; not expandable, no AC-Power supply, no DVD, no HDD, not second RS232"," ",null,null,null,null,null,null,null,null,null,1,null,"110/230V AC Industry power with Namur; without power cord (no BIS-certificate)",null,{"$f":"IF($P$15=2,1,\"\")","v":""}]
[3,null,{"$f":"IF(OR($P$8=1),1,0)","v":1},"restrictions with 12\"; not expandable, no AC-Power supply, no DVD, no HDD, not second RS232"," ",null,null,null,null,null,null,null,null,null,2,null,"110/230V AC Industry power with Namur; with power cord Europe (no BIS-certificate)",null,{"$f":"IF($P$15=3,1,\"\")","v":""}]
[4,null,{"$f":"IF(OR($P$8=1),1,0)","v":1},"restrictions with 12\"; not expandable, no AC-Power supply, no DVD, no HDD, not second RS232"," ",null,null,null,null,null,null,null,null,null,6,null,"110/230V AC Industry power with Namur; TPM; without power cord (no BIS-certificate)",null,{"$f":"IF($P$15=4,1,\"\")","v":""}]
[5,null,{"$f":"IF(OR($P$8=1),1,0)","v":1},"restrictions with 12\"; not expandable, no AC-Power supply, no DVD, no HDD, not second RS232"," ",null,null,null,null,null,null,null,null,null,7,null,"110/230V AC Industry power with Namur; TPM; with power cord Europe (no BIS-certificate)",null,{"$f":"IF($P$15=5,1,\"\")","v":""}]
[6,null,{"$f":"IF(OR($P$8=1),1,0)","v":1},"restrictions with 12\"; not expandable, no AC-Power supply, no DVD, no HDD, not second RS232"," ",null,null,null,null,null,null,null,null,null,8,null,"24V DC  Industry power supply and TPM",null,{"$f":"IF($P$15=6,1,\"\")","v":""}]
[null,null,null,null," "]
[null,null,null,null,null,null,null,null,null,null,null,null,null,null,null,null,"Base device",null,1]
[]
[null,null,null,null,null,null,null,null,null,null,null,null,null,null,null,null,null,"Total:"]
[]
[]
[]
[]
[]
[]
["ACCESSORI"]
["6ES7648-2AK70-0PA0",null,null,null,null,null,null,null,null,null,null,null,null,null,null,null,"Memory module 8 GB (1x 8 GB),DDR4 2400 SD-RAM, SODIMM"]
["6ES7648-2AK80-0PA0",null,null,null,null,null,null,null,null,null,null,null,null,null,null,null,"Memory module 16 GB (1x 16 GB),DDR4 2400 SD-RAM, SODIMM"]
["6ES7648-2AK70-1PA0",null,null,null,null,null,null,null,null,null,null,null,null,null,null,null,"Memory module 8 GB (1x 8 GB),DDR4 2400 SD-RAM, SODIMM ECC"]
["6ES7648-2AK80-1PA0",null,null,null,null,null,null,null,null,null,null,null,null,null,null,null,"Memory module 16 GB (1x 16 GB),DDR4 2400 SD-RAM, SODIMM ECC"]

{"sheet":"IPC PX-32A (Panel PC)","index":27,"n_rows":67,"n_cols":21,"rows_kept":67,"cut":false,"hidden":false,"merged":[[0,17,3,17]]}
["SIMATIC IPC PX-32A (Panel PC)",null,null,null,null,null,null,null,null,null,null,null,null,null,null,null,null,null,null,null,"."]
[null,null,null,null,null,null,null,null,null,null,null,null,null,null,null,null,{"$f":"$A$5&$B$5&$C$5&$D$5&$E$5&$F$5&$G$5&$H$5&$I$5&$J$5&$K$5&$L$5&$M$5&$N$5&$O$5","v":"6AV7272-1AA00-0AB1"}]
[]
[" ",null,null,null,null,8,9,10,11,12,null,13,14,15,16,null," "]
["6AV7",2,7,2,"-",{"$f":"VLOOKUP(P7,A21:Q22,6,TRUE)","v":1},{"$f":"VLOOKUP(P8,A25:Q28,7,TRUE)","v":"A"},{"$f":"VLOOKUP(P9,A31:Q34,8,TRUE)","v":"A"},{"$f":"VLOOKUP(P10,A37:Q39,9,TRUE)","v":0},{"$f":"VLOOKUP(P11,A42:Q42,10,TRUE)","v":0},"-",{"$f":"VLOOKUP(P12,A45:Q46,12,FALSE)","v":0},{"$f":"VLOOKUP(P13,A49:Q51,13,TRUE)","v":"A"},{"$f":"VLOOKUP(P14,A54:Q54,14,TRUE)","v":"B"},{"$f":"VLOOKUP(P15,A57:Q57,15,TRUE)","v":1},null,{"$f":" \"SIMATIC IPC PX-32A\" & \" (Panel PC)\"","v":"SIMATIC IPC PX-32A (Panel PC)"},{"$f":"T(Q2)","v":"6AV7272-1AA00-0AB1"}]
[null,null,null,"|",null,"|","|","|","|","|",null,"|","|","|","|",1,{"$f":"VLOOKUP(P6,A18:Q18,17,FALSE)","v":"Standard-Device"}]
[null,null,null,"|",null,"|","|","|","|","|",null,"|","|","|","|",1,{"$f":"VLOOKUP(P7,A21:Q22,17,FALSE)","v":"Intel Celeron 6600HLE (2,1 GHz, 2C/2T)"}," "]
[null,null,null,"|",null,"|","|","|","|","|",null,"|","|","|","|",1,{"$f":"VLOOKUP(P8,A25:Q28,17,FALSE)","v":"12\" Singletouch"}]
[2,null,null,"|",null,"|","|","|","|","|",null,"|","|","|","|",1,{"$f":"VLOOKUP(P9,A31:Q34,17,FALSE)","v":"4GB"}]
[null,null,null,"|",null,"|","|","|","|","|",null,"|","|","|","|",1,{"$f":"VLOOKUP(P10,A37:Q39,17,FALSE)","v":"without 1st mass-storage"}]
[null,null,null,"|",null,"|","|","|","|","|",null,"|","|","|","|",1,{"$f":"VLOOKUP(P11,A42:Q42,17,FALSE)","v":"without 2nd mass-storage"},"Link utili"]
[null,null,null,"|",null,"|","|","|","|","|",null,"|","|","|","|",1,{"$f":"VLOOKUP(P12,A45:Q46,17,FALSE)","v":"without operating system"},"Certificati"]
[null,null,null,"|",null,"|","|","|","|","|",null,"|","|","|","|",1,{"$f":"VLOOKUP(P13,A49:Q51,17,FALSE)","v":"without Option 1"},"Datasheet"]
[null,null,null,"|",null,"|","|","|","|","|",null,"|","|","|","|",1,{"$f":"VLOOKUP(P14,A54:Q54,17,FALSE)","v":"with USB-Stick (Restore-Image; D&D)"},"Manuale"]
[null,null,null,"|",null,"|","|","|","|","|",null,"|","|","|","|",1,{"$f":"VLOOKUP(P15,A57:Q57,17,FALSE)","v":"9-36V DC Industry-power supply (wide range)"},"CAD 2D/3D"]
[null,null,null,"|",null,"|","|","|","|","|",null,"|","|","|","|",null," "]
[null,null,null,"|",null,"|","|","|","|","|",null,"|","|","|","|",null,"Device"]
[1,null,null,2,null,"|","|","|","|","|",null,"|","|","|","|",null,"Standard-Device",null,{"$f":"IF($P$6=1,1,\"\")","v":1}]
[null,null,null,null,null,"|","|","|","|","|",null,"|","|","|","|"]
[null,null,null,null,null,"|","|","|","|","|",null,"|","|","|","|",null,"Processor"]
[1,null,null,null,null,1,"|","|","|","|",null,"|","|","|","|",null,"Intel Celeron 6600HLE (2,1 GHz, 2C/2T)",null,{"$f":"IF($P$7=1,1,\"\")","v":1}]
[2,null,null,null,null,3,"|","|","|","|",null,"|","|","|","|",null,"Intel Xeon W-11155MLE (1,8/3,1 GHz, 4C/8T)",null,{"$f":"IF($P$7=2,1,\"\")","v":""}]
[null,null,null,null,null,null,"|","|","|","|",null,"|","|","|","|"]
[null,null,null,null,null,null,"|","|","|","|",null,"|","|","|","|",null,"Front Panel"]
[1,null,null,null,null,null,"A","|","|","|",null,"|","|","|","|",null,"12\" Singletouch",null,{"$f":"IF($P$8=1,1,\"\")","v":1}]
[2,null,null,null,null,null,"B","|","|","|",null,"|","|","|","|",null,"15\" Singletouch",null,{"$f":"IF($P$8=2,1,\"\")","v":""}]
[3,null,null,null,null,null,"C","|","|","|",null,"|","|","|","|",null,"19\" Singletouch",null,{"$f":"IF($P$8=3,1,\"\")","v":""}]
[4,null,null,null,null,null,"D","|","|","|",null,"|","|","|","|",null,"22\" Singletouch",null,{"$f":"IF($P$8=4,1,\"\")","v":""}]
[" ",null,null,null,null,null,null,"|","|","|",null,"|","|","|","|"]
[null,null,null,null,null,null," ","|","|","|",null,"|","|","|","|",null,"RAM"]
[1,null,null,null,null,null,null,"A","|","|",null,"|","|","|","|",null,"4GB",null,{"$f":"IF($P$9=1,1,\"\")","v":1}]
[2,null,null,null,null,null,null,"B","|","|",null,"|","|","|","|",null,"8GB",null,{"$f":"IF($P$9=2,1,\"\")","v":""}]
[3,null,null,null,null,null,null,"C","|","|",null,"|","|","|","|",null,"16GB",null,{"$f":"IF($P$9=3,1,\"\")","v":""}]
[4,null,null,null,null,null,null,{"$f":"IF($P$7<>3,\"D\",\"#\")","v":"D"},"|","|",null,"|","|","|","|",null,"32GB",null,{"$f":"IF($P$9=4,1,\"\")","v":""}]
[null,null,null,null,null,null,null,null,"|","|",null,"|","|","|","|",null," "]
[null,null,null,null,null,null,null,null,"|","|",null,"|","|","|","|",null,"Drive 1 (incl. OS)"]
[1,null,null,null,null,null,null,null,0,"|",null,"|","|","|","|",null,"without 1st mass-storage",null,{"$f":"IF($P$10=1,1,\"\")","v":1}]
[2," ",null,null," ",null,null,null,1,"|",null,"|","|","|","|",null,"M.2 SSD 256 GB Eco",null,{"$f":"IF($P$10=2,1,\"\")","v":""}]
[3,null,null,null,null,null,null,null,2,"|",null,"|","|","|","|",null,"M.2 SSD 512 GB Eco",null,{"$f":"IF($P$10=3,1,\"\")","v":""}]
[null,null,null,null,null,null,null,null,null,"|",null,"|","|","|","|"]
[null,null,null,null,null,null,null,null,null,"|",null,"|","|","|","|",null,"Drive 2"]
[1,null,null,null,null,null,null,null,null,0,null,"|","|","|","|",1,"without 2nd mass-storage",null,{"$f":"IF($P$11=1,1,\"\")","v":1}]
[" ",null,null,null,null,null,null,null,null,null,null,"|","|","|","|"]
[null,null,null,null,null,null,null,null,null,null,null,"|","|","|","|",null,"Software configuration"]
[1,null,null,null,null,null,null,null,null,null,null,0,"|","|","|",null,"without operating system",null,{"$f":"IF($P$12=1,1,\"\")","v":1}]
[2,null,null,null,null,null,null,null,null,null,null,{"$f":"IF($P$10=1,\"#\",\"1\")","v":"#"},"|","|","|",null,"Windows 10 IoT Enterprise 2021 LTSC",null,{"$f":"IF($P$12=2,1,\"\")","v":""}]
[null,null,null,null,null,null,null,null,null,null,null,null,"|","|","|"]
[null,null,null,null,null,null," ",null,null,null,null,null,"|","|","|",null,"Option 1"]
[1,null,null,null,null,null,null,null,null,null," ",null,"A","|","|",null,"without Option 1",null,{"$f":"IF($P$13=1,1,\"\")","v":1}]
[2,null,null,null,null,null,null,null,null,null,null,null,"C","|","|",null,"additiv 1 x Com (RS232) (3 in total)",null,{"$f":"IF($P$13=2,1,\"\")","v":""}]
[3,null,null,null,null,null,null,null,null,null,null,null,"D","|","|",null,"additiv 2 x Com (RS232) (4 in total)",null,{"$f":"IF($P$13=3,1,\"\")","v":""}]
[null,null,null,null,null,null,null,null,null,null,null,null,null,"|","|"]
[null,null,null,null,null,null,null,null,null,null,null,null,null,"|","|",null,"Option 2"]
[1,null,null,null,null,null,null,null,null,null,null,null,null,"B","|",null,"with USB-Stick (Restore-Image; D&D)",null,1]
[null,null,null,null,null,null," "," "," "," "," "," "," "," ","|"," ",null,null," "]
[null,null,null,null,null,null," "," "," "," "," "," "," ",null,"|",null,"Power Supply"]
[1,null,null,null,null,null,null,null,null,null,null,null,null,null,1,null,"9-36V DC Industry-power supply (wide range)",null,{"$f":"IF($P$15=1,1,\"\")","v":1}]
[null,null,null,null,null,null,null,null,null,null,null,null,null,null,null,null,"Basedevice",null,1]
[]
[null,null,null,null,null,null,null,null,null,null,null,null,null,null,null,null,null,"Totale:"]
[]
[]
[]
["Accessori"]
["6ES7648-2AK70-0RA0",null,null,null,null,null,null,null,null,null,null,null,null,null,null,null,"RAM Module 8 GB (1x 8 GB) DDR4 3200, SDRAM, SO-DIMM"]
["6ES7648-2AK80-0RA0",null,null,null,null,null,null,null,null,null,null,null,null,null,null,null,"RAM Module 16 GB (1x 16 GB) DDR4 3200, SDRAM, SO-DIMM"]
["6ES7648-2AK81-0RA0",null,null,null,null,null,null,null,null,null,null,null,null,null,null,null,"RAM Module 32 GB (1x 32 GB) DDR4 3200, SDRAM, SO-DIMM"]

{"sheet":"IPC PX-39A (Panel PC)","index":28,"n_rows":104,"n_cols":19,"rows_kept":104,"cut":false,"hidden":false,"merged":[[0,17,3,17]]}
["SIMATIC IPC PX-39A (Panel PC)",null,null,null,null,null,null,null,null,null,null,null,null,null,null,null,{"$f":"$A$5&$B$5&$C$5&$D$5&$E$5&$F$5&$G$5&$H$5&$I$5&$J$5&$K$5&$L$5&$M$5&$N$5&$O$5","v":"6AV7242-1AA00-0AA0"}]
[null,null,null,null,null,null,null,null,null,null,null,null,null,null,null,null,{"$f":"$A$5&$B$5&$C$5&$D$5&$E$5&$F$5&$G$5&$H$5&$I$5&$J$5&$K$5&$L$5&$M$5&$N$5&$O$5","v":"6AV7242-1AA00-0AA0"}]
[null,null,{"$f":"IF(OR(F5=\"#\",G5=\"#\",H5=\"#\",I5=\"#\",J5=\"#\",L5=\"#\",M5=\"#\",N5=\"#\",O5=\"#\"),1,0)","v":0},"Configuration not possible. Mind the combinations of the options",null,null,null,null,null,null,null,null,null,null,null,null,{"$f":"IF(C3,D3,\"\")","v":""}]
[" ",null,null,null,null,8,9,10,11,12,null,13,14,15,16]
["6AV7",2,4,2,"-",{"$f":"VLOOKUP(P7,A21:Q24,6,TRUE)","v":1},{"$f":"VLOOKUP(P8,A27:Q35,7,TRUE)","v":"A"},{"$f":"VLOOKUP(P9,A38:Q48,8,TRUE)","v":"A"},{"$f":"VLOOKUP(P10,A51:Q57,9,TRUE)","v":0},{"$f":"VLOOKUP(P11,A60:Q65,10,TRUE)","v":"0"},"-",{"$f":"VLOOKUP(P12,A68:Q71,12,FALSE)","v":0},{"$f":"VLOOKUP(P13,A74:Q77,13,TRUE)","v":"A"},{"$f":"VLOOKUP(P14,A80:Q81,14,TRUE)","v":"A"},{"$f":"VLOOKUP(P15,A84:Q87,15,TRUE)","v":0},null,{"$f":" \"SIMATIC IPC PX-39A\" & \" (Panel PC)\"","v":"SIMATIC IPC PX-39A (Panel PC)"},{"$f":"T(Q2)","v":"6AV7242-1AA00-0AA0"}]
[null,null,null,"|",null,"|","|","|","|","|",null,"|","|","|","|",1,{"$f":"VLOOKUP(P6,A18:Q18,17,FALSE)","v":"Standard-Device"}]
[null,null,null,"|",null,"|","|","|","|","|",null,"|","|","|","|",1,{"$f":"VLOOKUP(P7,A21:Q24,17,FALSE)","v":"Intel Celeron 6600HLE (2,1 GHz, 2C/2T)"}," "]
[null,null,null,"|",null,"|","|","|","|","|",null,"|","|","|","|",1,{"$f":"VLOOKUP(P8,A27:Q35,17,FALSE)","v":"15\" Multi-Touch (1920 x 1080)"}]
[null,null,null,"|",null,"|","|","|","|","|",null,"|","|","|","|",1,{"$f":"VLOOKUP(P9,A38:Q48,17,FALSE)","v":"4GB"}]
[null,null,null,"|",null,"|","|","|","|","|",null,"|","|","|","|",1,{"$f":"VLOOKUP(P10,A51:Q57,17,FALSE)","v":"without 1st mass-storage"}]
[null,null,null,"|",null,"|","|","|","|","|",null,"|","|","|","|",1,{"$f":"VLOOKUP(P11,A60:Q65,17,FALSE)","v":"without 2nd mass-storage"},"Link utili"]
[null,null,null,"|",null,"|","|","|","|","|",null,"|","|","|","|",1,{"$f":"VLOOKUP(P12,A68:Q71,17,FALSE)","v":"without operating system"},"Certificati"]
[null,null,null,"|",null,"|","|","|","|","|",null,"|","|","|","|",1,{"$f":"VLOOKUP(P13,A74:Q77,17,FALSE)","v":"without Option 1"},"Datasheet"]
[null,null,null,"|",null,"|","|","|","|","|",null,"|","|","|","|",1,{"$f":"VLOOKUP(P14,A80:Q81,17,FALSE)","v":"without USB-Stick (Restore-Image; D&D)"},"Manuale"]
[null,null,null,"|",null,"|","|","|","|","|",null,"|","|","|","|",1,{"$f":"VLOOKUP(P15,A84:Q87,17,FALSE)","v":"24V DC Industry-power supply (Premium, NAU, isolated)"},"CAD 2D/3D"]
[null,null,null,"|",null,"|","|","|","|","|",null,"|","|","|","|",null," "]
[null,null,null,"|",null,"|","|","|","|","|",null,"|","|","|","|",null,"Device"]
[1,null,null,2,null,"|","|","|","|","|",null,"|","|","|","|",null,"Standard-Device",null,{"$f":"IF($P$6=1,1,\"\")","v":1}]
[null,null,null,null,null,"|","|","|","|","|",null,"|","|","|","|"]
[null,null,null,null,null,"|","|","|","|","|",null,"|","|","|","|",null,"Processor"]
[1,null,null,null,null,1,"|","|","|","|",null,"|","|","|","|",null,"Intel Celeron 6600HLE (2,1 GHz, 2C/2T)",null,{"$f":"IF($P$7=1,1,\"\")","v":1}]
[2,null,null,null,null,3,"|","|","|","|",null,"|","|","|","|",null,"Intel Xeon W-11155MLE (1,8/3,1 GHz, 4C/8T)",null,{"$f":"IF($P$7=2,1,\"\")","v":""}]
[3,null,null,null,null,5,"|","|","|","|",null,"|","|","|","|",null,"Intel Xeon W-11555MLE (1,9/4,4 GHz, 6C/12T)",null,{"$f":"IF($P$7=3,1,\"\")","v":""}]
[4,null,null,null,null,7,"|","|","|","|",null,"|","|","|","|",null,"Intel Xeon W-11865MLE (1,5/4,5 GHz, 8C/16T)",null,{"$f":"IF($P$7=4,1,\"\")","v":""}]
[null,null,null,null,null,null,"|","|","|","|",null,"|","|","|","|"]
[null,null,null,null,null,null,"|","|","|","|",null,"|","|","|","|",null,"Front Panel"]
[1,null,null,null,null,null,"A","|","|","|",null,"|","|","|","|",null,"15\" Multi-Touch (1920 x 1080)",null,{"$f":"IF($P$8=1,1,\"\")","v":1}]
[2,null,null,null,null,null,"B","|","|","|",null,"|","|","|","|",null,"19\" Multi-Touch (1920 x 1080)",null,{"$f":"IF($P$8=2,1,\"\")","v":""}]
[3,null,null,null,null,null,"C","|","|","|",null,"|","|","|","|",null,"22\" Multi-Touch (1920 x 1080)",null,{"$f":"IF($P$8=3,1,\"\")","v":""}]
[4,null,null,null,null,null,"D","|","|","|",null,"|","|","|","|",null,"24\" Multi-Touch (1920 x 1080)",null,{"$f":"IF($P$8=4,1,\"\")","v":""}]
[5,null,null,null,null,null,"E","|","|","|",null,"|","|","|","|",null,"12\" Multi-Touch (1280 x 800)",null,{"$f":"IF($P$8=5,1,\"\")","v":""}]
[6,null,null,null,null,null,"L","|","|","|",null,"|","|","|","|",null,"15\" Multi-Touch Neutral (1920 x 1080)",null,{"$f":"IF($P$8=6,1,\"\")","v":""}]
[7,null,null,null,null,null,"M","|","|","|",null,"|","|","|","|",null,"19\" Multi-Touch Neutral (1920 x 1080)",null,{"$f":"IF($P$8=7,1,\"\")","v":""}]
[8,null,null,null,null,null,"N","|","|","|",null,"|","|","|","|",null,"22\" Multi-Touch Neutral (1920 x 1080)",null,{"$f":"IF($P$8=8,1,\"\")","v":""}]
[9,null,null,null,null,null,"P","|","|","|",null,"|","|","|","|",null,"24\" Multi-Touch Neutral (1920 x 1080)",null,{"$f":"IF($P$8=9,1,\"\")","v":""}]
[" ",null,null,null,null,null,null,"|","|","|",null,"|","|","|","|"]
[null,null,null,null,null,null," ","|","|","|",null,"|","|","|","|",null,"RAM"]
[1,null,null,null,null,null,null,"A","|","|",null,"|","|","|","|",null,"4GB",null,{"$f":"IF($P$9=1,1,\"\")","v":1}]
[2,null,null,null,null,null,null,"B","|","|",null,"|","|","|","|",null,"8GB",null,{"$f":"IF($P$9=2,1,\"\")","v":""}]
[3,null,null,null,null,null,null,"C","|","|",null,"|","|","|","|",null,"16GB",null,{"$f":"IF($P$9=3,1,\"\")","v":""}]
[4,null,null,null,null,null,null,"D","|","|",null,"|","|","|","|",null,"32GB",null,{"$f":"IF($P$9=4,1,\"\")","v":""}]
[5,null,null,null,null,null,null,"E","|","|",null,"|","|","|","|",null,"16GB with ECC",null,{"$f":"IF($P$9=5,1,\"\")","v":""}]
[6,null,null,"Arbeitsspeicher mit ECC nur in Verbindung mit Core i7 mit IE/PN (Option \"6\")",".",null,null,"F","|","|",null,"|","|","|","|",null,"32GB with ECC",null,{"$f":"IF($P$9=6,1,\"\")","v":""}]
[7,null,null,null,null,null,null,"G","|","|",null,"|","|","|","|",null,"8GB and NVRAM (M.2 Modul)",null,{"$f":"IF($P$9=7,1,\"\")","v":""}]
[8,null,null,null,null,null,null,"H","|","|",null,"|","|","|","|",null,"16GB and NVRAM (M.2 Modul)",null,{"$f":"IF($P$9=8,1,\"\")","v":""}]
[9,null,null,null,null,null,null,"J","|","|",null,"|","|","|","|",null,"32GB and NVRAM (M.2 Modul)",null,{"$f":"IF($P$9=9,1,\"\")","v":""}]
[10,null,null,null,null,null,null,"K","|","|",null,"|","|","|","|",null,"16GB with ECC and NVRAM (M.2 Modul)",null,{"$f":"IF($P$9=10,1,\"\")","v":""}]
[11,null,null,null,".",null,null,"L","|","|",null,"|","|","|","|",null,"32GB with ECC and NVRAM (M.2 Modul)",null,{"$f":"IF($P$9=11,1,\"\")","v":""}]
[null,null,null,null,null,null,null,null,"|","|",null,"|","|","|","|",null," "]
[null,null,null,null,null,null,null,null,"|","|",null,"|","|","|","|",null,"Drive 1 in Simatic IPC Slider (incl. OS)"]
[1,null,null,null,null,null,null,null,0,"|",null,"|","|","|","|",null,"without 1st mass-storage",null,{"$f":"IF($P$10=1,1,\"\")","v":1}]
[2," ",null,null," ",null,null,null,1,"|",null,"|","|","|","|",null,"M.2 SSD 256 GB Eco",null,{"$f":"IF($P$10=2,1,\"\")","v":""}]
[3,null,null,null," ",null,null,null,2,"|",null,"|","|","|","|",null,"M.2 SSD 512 GB Eco",null,{"$f":"IF($P$10=3,1,\"\")","v":""}]
[4," ",null,null," ",null,null,null,4,"|",null,"|","|","|","|",null,"M.2 SSD 240 GB",null,{"$f":"IF($P$10=4,1,\"\")","v":""}]
[5,null,null,null," ",null,null,null,5,"|",null,"|","|","|","|",null,"M.2 SSD 480 GB",null,{"$f":"IF($P$10=5,1,\"\")","v":""}]
[6," ",null,null," ",null,null,null,6,"|",null,"|","|","|","|",null,"M.2 SSD 960 GB",null,{"$f":"IF($P$10=6,1,\"\")","v":""}]
[7,null,null,null," ",null,null,null,8,"|",null,"|","|","|","|",null,"RAID1 2x SSD 512 GB Eco (only if Drive 2 is SSD 512 GB Eco)",null,{"$f":"IF($P$10=7,1,\"\")","v":""}]
[null,null,null,null,null,null,null,null,null,"|",null,"|","|","|","|"]
[null,null,null,null,null,null,null,null,null,"|",null,"|","|","|","|",null,"Drive 2 in Simatic IPC Slider"]
[1,null,null,null,null,null,null,null,null,{"$f":"IF(OR($P$10=7),\"#\",\"0\")","v":"0"},null,"|","|","|","|",null,"without 2nd mass-storage",null,{"$f":"IF($P$11=1,1,\"\")","v":1}]
[2,null,null,null,null,null,null,null,null,{"$f":"IF(OR($P$10=1, $P$10=7),\"#\",\"1\")","v":"#"},null,"|","|","|","|",null,"M.2 SSD 256 GB Eco",null,{"$f":"IF($P$11=2,1,\"\")","v":""}]
[3,null,null,null,null,null,null,null,null,{"$f":"IF(OR($P$10=1),\"#\",\"2\")","v":"#"},null,"|","|","|","|",null,"M.2 SSD 512 GB Eco",null,{"$f":"IF($P$11=3,1,\"\")","v":""}]
[4,null,null,null,null,null,null,null,null,{"$f":"IF(OR($P$10=1, $P$10=7),\"#\",\"4\")","v":"#"},null,"|","|","|","|",null,"M.2 SSD 240 GB",null,{"$f":"IF($P$11=4,1,\"\")","v":""}]
[5,null,null,null,null,null,null,null,null,{"$f":"IF(OR($P$10=1, $P$10=7),\"#\",\"5\")","v":"#"},null,"|","|","|","|",null,"M.2 SSD 480 GB",null,{"$f":"IF($P$11=5,1,\"\")","v":""}]
[6,null,null,null,null,null,null,null,null,{"$f":"IF(OR($P$10=1, $P$10=7),\"#\",\"6\")","v":"#"},null,"|","|","|","|",null,"M.2 SSD 960 GB",null,{"$f":"IF($P$11=6,1,\"\")","v":""}]
[" ",null,null,null,null,null,null,null,null,null,null,"|","|","|","|"]
[null,null,null,null,null,null,null,null,null,null,null,"|","|","|","|",null,"Software configuration"]
[1,null,null,null,null,null,null,null,null,null,null,0,"|","|","|",null,"without operating system",null,{"$f":"IF($P$12=1,1,\"\")","v":1}]
[2,null,null,null,null,null,null,null,null,null,null,{"$f":"IF(OR(AND($P$10=1,$P$11=1),$P$7=4),\"#\",\"1\")","v":"#"},"|","|","|",null,"Windows 10 IoT Enterprise 2021 LTSC with processors Celeron, W-11155MLE, W-11555MLE",null,{"$f":"IF($P$12=2,1,\"\")","v":""}]
[3,null,null,null,null,null,null,null,null,null,null,{"$f":"IF(OR(AND($P$10=1,$P$11=1),$P$7<4),\"#\",\"2\")","v":"#"},"|","|","|",null,"Windows 10 IoT Enterprise 2021 LTSC with processor W-11865MLE",null,{"$f":"IF($P$12=3,1,\"\")","v":""}]
[4,null,null,null,null,null,null,null,null,null,null,{"$f":"IF(OR($P$10=1,$P$10=7),\"#\",\"7\")","v":"#"},"|","|","|",null,"SIMATIC Industrial OS",null,{"$f":"IF($P$12=4,1,\"\")","v":""}]
[null,null,null,null,null,null,null,null,null,null,null,null,"|","|","|"]
[null,null,null,null,null,null," ",null,null,null,null,null,"|","|","|",null,"Option 1"]
[1,null,null,null,null,null,null,null,null,null," ",null,"A","|","|",null,"without Option 1",null,{"$f":"IF($P$13=1,1,\"\")","v":1}]
[2,null,null,null,null,null,null,null,null,null,null,null,"B","|","|",null,"with 1 x PCIe-Slot",null,{"$f":"IF($P$13=2,1,\"\")","v":""}]
[3,null,null,null,null,null,null,null,null,null,null,null,"C","|","|",null,"with additional 1 x Com (RS232/485/422)",null,{"$f":"IF($P$13=3,1,\"\")","v":""}]
[4,null,null,null,null,null,null,null,null,null,null,null,"D","|","|",null,"with 1 x PCIe-Slot and additional 1 x Com (RS232/485/422)",null,{"$f":"IF($P$13=4,1,\"\")","v":""}]
[null,null,null,null,null,null,null,null,null,null,null,null,null,"|","|"]
[null,null,null,null,null,null,null,null,null,null,null,null,null,"|","|",null,"Option 2"]
[1,null,null,null,null,null," "," "," "," "," "," "," ","A","|",null,"without USB-Stick (Restore-Image; D&D)",null,{"$f":"IF($P$14=1,1,\"\")","v":1}]
[2,null,null,null,null,null,null,null,null,null,null,null,null,{"$f":"IF(OR($P$12=4),\"#\",\"B\")","v":"B"},"|",null,"with USB-Stick (Restore-Image; D&D)",null,{"$f":"IF($P$14=2,1,\"\")","v":""}]
[null,null,null,null,null,null," "," "," "," "," "," "," "," ","|"," ",null,null," "]
[null,null,null,null,null,null," "," "," "," "," "," "," ",null,"|",null,"Power Supply"]
[1,null,null,null,null,null,null,null,null,null,null,null,null,null,0,null,"24V DC Industry-power supply (Premium, NAU, isolated)",null,{"$f":"IF($P$15=1,1,\"\")","v":1}]
[2,null,{"$f":"IF(OR($P$8=1),1,0)","v":1},null," ",null,null,null,null,null,null,null,null,null,2,null,"110/230V AC Industrial PS with NAMUR; no power cord",null,{"$f":"IF($P$15=2,1,\"\")","v":""}]
[3,null,{"$f":"IF(OR($P$8=1),1,0)","v":1},null," ",null,null,null,null,null,null,null,null,null,3,null,"110/230V AC  Industrial PS with Namur; with power cord Europe",null,{"$f":"IF($P$15=3,1,\"\")","v":""}]
[4,null,{"$f":"IF(OR($P$8=1),1,0)","v":1},null," ",null,null,null,null,null,null,null,null,null,7,null,"24V DC Industry-power supply (NAU, isolated,with hold-up time) with ATEX/IECEx/UL HazLoc",null,{"$f":"IF($P$15=4,1,\"\")","v":""}]
[]
[null,null,null,null,null,null,null,null,null,null,null,null,null,null,null,null,"Base device",null,1]
[]
[null,null,null,null,null,null,null,null,null,null,null,null,null,null,null,null,null,"Total:"]
[]
[]
[]
["Accessori"]
["6ES7648-0EK00-0GA1",null,null,null,null,null,null,null,null,null,null,null,null,null,null,null,"SIMATIC IPC Slider for M.2 SSD, no SSD"]
["6ES7648-0EK10-0GA3",null,null,null,null,null,null,null,null,null,null,null,null,null,null,null,"SIMATIC IPC Slider for M.2 SSD, with 256 GB Eco"]
["6ES7648-0EK20-0GA3",null,null,null,null,null,null,null,null,null,null,null,null,null,null,null,"SIMATIC IPC Slider for M.2 SSD, with 512 GB Eco"]
["6ES7648-2AK70-0RA0",null,null,null,null,null,null,null,null,null,null,null,null,null,null,null,"RAM Module 8 GB (1x 8 GB) DDR4 3200, SDRAM, SO-DIMM"]
["6ES7648-2AK80-0RA0",null,null,null,null,null,null,null,null,null,null,null,null,null,null,null,"RAM Module 16 GB (1x 16 GB) DDR4 3200, SDRAM, SO-DIMM"]
["6ES7648-2AK81-0RA0",null,null,null,null,null,null,null,null,null,null,null,null,null,null,null,"RAM Module 32 GB (1x 32 GB) DDR4 3200, SDRAM, SO-DIMM"]
["6ES7648-2AK80-1RA0",null,null,null,null,null,null,null,null,null,null,null,null,null,null,null,"RAM Module 16 GB (1x 16 GB) DDR4 3200, SDRAM, SO-DIMM ECC"]
["6ES7648-2AK81-1RA0",null,null,null,null,null,null,null,null,null,null,null,null,null,null,null,"RAM Module 32 GB (1x 32 GB) DDR4 3200, SDRAM, SO-DIMM ECC"]
["6ES7648-0DK00-0HA0",null,null,null,null,null,null,null,null,null,null,null,null,null,null,null,"Module SIMATIC IPC M.2 NvRAM "]

{"sheet":"IPC PX-39A PRO","index":29,"n_rows":96,"n_cols":19,"rows_kept":96,"cut":false,"hidden":false,"merged":[[0,17,3,17]]}
["SIMATIC IPC PX-39A PRO (Panel PC)",null,null,null,null,null,null,null,null,null,null,null,null,null,null,null,{"$f":"$A$5&$B$5&$C$5&$D$5&$E$5&$F$5&$G$5&$H$5&$I$5&$J$5&$K$5&$L$5&$M$5&$N$5&$O$5","v":"6AV7252-1AA10-0AA0"}]
[null,null,null,null,null,null,null,null,null,null,null,null,null,null,null,null,{"$f":"$A$5&$B$5&$C$5&$D$5&$E$5&$F$5&$G$5&$H$5&$I$5&$J$5&$K$5&$L$5&$M$5&$N$5&$O$5","v":"6AV7252-1AA10-0AA0"}]
[null,null,{"$f":"IF(OR(F5=\"#\",G5=\"#\",H5=\"#\",I5=\"#\",J5=\"#\",L5=\"#\",M5=\"#\",N5=\"#\",O5=\"#\"),1,0)","v":0},"Configuration not possible. Remarks below.",null,null,null,null,null,null,null,null,null,null,null," ",{"$f":"IF(C3,D3,\"\")","v":""}]
[" ",null,null,null,null,8,9,10,11,12,null,13,14,15,16,null," "]
["6AV7",2,5,2,"-",{"$f":"VLOOKUP(P7,A21:Q24,6,TRUE)","v":1},{"$f":"VLOOKUP(P8,A27:Q34,7,TRUE)","v":"A"},{"$f":"VLOOKUP(P9,A37:Q47,8,TRUE)","v":"A"},{"$f":"VLOOKUP(P10,A50:Q55,9,TRUE)","v":1},{"$f":"VLOOKUP(P11,A58:Q61,10,TRUE)","v":"0"},"-",{"$f":"VLOOKUP(P12,A64:Q67,12,FALSE)","v":0},{"$f":"VLOOKUP(P13,A70:Q72,13,TRUE)","v":"A"},{"$f":"VLOOKUP(P14,A75:Q76,14,TRUE)","v":"A"},{"$f":"VLOOKUP(P15,A79:Q80,15,TRUE)","v":0},null,{"$f":" \"SIMATIC IPC PX-39A Pro\" & \" (fully enclosed Panel PC, IP65)\"","v":"SIMATIC IPC PX-39A Pro (fully enclosed Panel PC, IP65)"},{"$f":"T(Q2)","v":"6AV7252-1AA10-0AA0"}]
[null,null,null,"|",null,"|","|","|","|","|",null,"|","|","|","|",1,{"$f":"VLOOKUP(P6,A18:Q18,17,FALSE)","v":"IP65 fully enclosed device"}]
[null,null,null,"|",null,"|","|","|","|","|",null,"|","|","|","|",1,{"$f":"VLOOKUP(P7,A21:Q24,17,FALSE)","v":"Intel Celeron 6600HLE (2,1 GHz, 2C/2T)"}," "]
[null,null,null,"|",null,"|","|","|","|","|",null,"|","|","|","|",1,{"$f":"VLOOKUP(P8,A27:Q34,17,FALSE)","v":"15\" Multi-Touch (1920 x 1080)"}]
[null,null,null,"|",null,"|","|","|","|","|",null,"|","|","|","|",1,{"$f":"VLOOKUP(P9,A37:Q47,17,FALSE)","v":"4GB"}]
[null,null,null,"|",null,"|","|","|","|","|",null,"|","|","|","|",2,{"$f":"VLOOKUP(P10,A50:Q55,17,FALSE)","v":"M.2 SSD 256 GB Eco"}]
[null,null,null,"|",null,"|","|","|","|","|",null,"|","|","|","|",1,{"$f":"VLOOKUP(P11,A58:Q61,17,FALSE)","v":"without 2nd mass-storage"},"Link utili"]
[null,null,null,"|",null,"|","|","|","|","|",null,"|","|","|","|",1,{"$f":"VLOOKUP(P12,A64:Q67,17,FALSE)","v":"without operating system"},"Certificati"]
[null,null,null,"|",null,"|","|","|","|","|",null,"|","|","|","|",1,{"$f":"VLOOKUP(P13,A70:Q72,17,FALSE)","v":"pedestal mounting (expandable, flange below)"},"Datasheet"]
[null,null,null,"|",null,"|","|","|","|","|",null,"|","|","|","|",1,{"$f":"VLOOKUP(P14,A75:Q76,17,FALSE)","v":"without USB-Stick (Restore-Image; D&D)"},"Manuale"]
[null,null,null,"|",null,"|","|","|","|","|",null,"|","|","|","|",1,{"$f":"VLOOKUP(P15,A79:Q80,17,FALSE)","v":"24V DC Industrial Powersupply (Premium, NAU, isolated)"},"CAD 2D/3D"]
[null,null,null,"|",null,"|","|","|","|","|",null,"|","|","|","|",null," "]
[null,null,null,"|",null,"|","|","|","|","|",null,"|","|","|","|",null,"Device"]
[1,null,null,2,null,"|","|","|","|","|",null,"|","|","|","|",null,"IP65 fully enclosed device",null,{"$f":"IF($P$6=1,1,\"\")","v":1}]
[null,null,null,null,null,"|","|","|","|","|",null,"|","|","|","|"]
[null,null,null,null,null,"|","|","|","|","|",null,"|","|","|","|",null,"Processor"]
[1,null,null,null,null,1,"|","|","|","|",null,"|","|","|","|",null,"Intel Celeron 6600HLE (2,1 GHz, 2C/2T)",null,{"$f":"IF($P$7=1,1,\"\")","v":1}]
[2,null,null,null,null,3,"|","|","|","|",null,"|","|","|","|",null,"Intel Xeon W-11155MLE (1,8/3,1 GHz, 4C/8T)",null,{"$f":"IF($P$7=2,1,\"\")","v":""}]
[3,null,null,null,null,5,"|","|","|","|",null,"|","|","|","|",null,"Intel Xeon W-11555MLE (1,9/4,4 GHz, 6C/12T)",null,{"$f":"IF($P$7=3,1,\"\")","v":""}]
[4,null,null,null,null,7,"|","|","|","|",null,"|","|","|","|",null,"Intel Xeon W-11865MLE (1,5/4,5 GHz, 8C/16T)",null,{"$f":"IF($P$7=4,1,\"\")","v":""}]
[null,null,null,null,null,null,"|","|","|","|",null,"|","|","|","|"]
[null,null,null,null,null,null,"|","|","|","|",null,"|","|","|","|",null,"Front Panel (mounting possibilities selectable with Option 1)"]
[1,null,null,null,null,null,"A","|","|","|",null,"|","|","|","|",null,"15\" Multi-Touch (1920 x 1080)",null,{"$f":"IF($P$8=1,1,\"\")","v":1}]
[2,null,null,null,null,null,"C","|","|","|",null,"|","|","|","|",null,"19\" Multi-Touch (1920 x 1080)",null,{"$f":"IF($P$8=2,1,\"\")","v":""}]
[3,null,null,null,null,null,"E","|","|","|",null,"|","|","|","|",null,"22\" Multi-Touch (1920 x 1080)",null,{"$f":"IF($P$8=3,1,\"\")","v":""}]
[4,null,null,null,null,null,"G","|","|","|",null,"|","|","|","|",null,"24\" Multi-Touch (1920 x 1080)",null,{"$f":"IF($P$8=4,1,\"\")","v":""}]
[5,null,null,null,null,null,"K","|","|","|",null,"|","|","|","|",null,"15\" Multi-Touch Neutral (1920 x 1080)",null,{"$f":"IF($P$8=5,1,\"\")","v":""}]
[6,null,null,null,null,null,"M","|","|","|",null,"|","|","|","|",null,"19\" Multi-Touch Neutral (1920 x 1080)",null,{"$f":"IF($P$8=6,1,\"\")","v":""}]
[7,null,null,null,null,null,"P","|","|","|",null,"|","|","|","|",null,"22\" Multi-Touch Neutral (1920 x 1080)",null,{"$f":"IF($P$8=7,1,\"\")","v":""}]
[8,null,null,null,null,null,"R","|","|","|",null,"|","|","|","|",null,"24\" Multi-Touch Neutral (1920 x 1080)",null,{"$f":"IF($P$8=8,1,\"\")","v":""}]
[" ",null,null,null,null,null,null,"|","|","|",null,"|","|","|","|"]
[null,null,null,null,null,null," ","|","|","|",null,"|","|","|","|",null,"RAM"]
[1,null,null,null,null,null,null,"A","|","|",null,"|","|","|","|",null,"4GB",null,{"$f":"IF($P$9=1,1,\"\")","v":1}]
[2,null,null,null,null,null,null,"B","|","|",null,"|","|","|","|",null,"8GB",null,{"$f":"IF($P$9=2,1,\"\")","v":""}]
[3,null,null,null,null,null,null,"C","|","|",null,"|","|","|","|",null,"16GB",null,{"$f":"IF($P$9=3,1,\"\")","v":""}]
[4,null,null,null,null,null,null,"D","|","|",null,"|","|","|","|",null,"32GB",null,{"$f":"IF($P$9=4,1,\"\")","v":""}]
[5,null,null,null,null,null,null,"E","|","|",null,"|","|","|","|",null,"16GB with ECC",null,{"$f":"IF($P$9=5,1,\"\")","v":""}]
[6,null,null,null,null,null,null,"F","|","|",null,"|","|","|","|",null,"32GB with ECC",null,{"$f":"IF($P$9=6,1,\"\")","v":""}]
[7,null,null,null,null,null,null,"G","|","|",null,"|","|","|","|",null,"8GB and NVRAM (M.2 Modul)",null,{"$f":"IF($P$9=7,1,\"\")","v":""}]
[8,null,null,null,null,null,null,"H","|","|",null,"|","|","|","|",null,"16GB and NVRAM (M.2 Modul)",null,{"$f":"IF($P$9=8,1,\"\")","v":""}]
[9,null,null,null,null,null,null,"J","|","|",null,"|","|","|","|",null,"32GB and NVRAM (M.2 Modul)",null,{"$f":"IF($P$9=9,1,\"\")","v":""}]
[10,null,null,null,null,null,null,"K","|","|",null,"|","|","|","|",null,"16GB with ECC and NVRAM (M.2 Modul)",null,{"$f":"IF($P$9=10,1,\"\")","v":""}]
[11,null,null,null,".",null,null,"L","|","|",null,"|","|","|","|",null,"32GB with ECC and NVRAM (M.2 Modul)",null,{"$f":"IF($P$9=11,1,\"\")","v":""}]
[null,null,null,null,null,null,null,null,"|","|",null,"|","|","|","|",null," "]
[null,null,null,null,null,null,null,null,"|","|",null,"|","|","|","|",null,"Drive 1"]
[1,null,null,null,null,null,null,null,0,"|",null,"|","|","|","|",null,"without 1st mass-storage",null,{"$f":"IF($P$10=1,1,\"\")","v":""}]
[2,null,null,null,null,null,null,null,1,"|",null,"|","|","|","|",null,"M.2 SSD 256 GB Eco",null,{"$f":"IF($P$10=2,1,\"\")","v":1}]
[3,null,null,null,null,null,null,null,2,"|",null,"|","|","|","|",null,"M.2 SSD 512 GB Eco",null,{"$f":"IF($P$10=3,1,\"\")","v":""}]
[4,null,null,null,null,null,null,null,4,"|",null,"|","|","|","|",null,"M.2 SSD 240 GB",null,{"$f":"IF($P$10=4,1,\"\")","v":""}]
[5,null,null,null,null,null,null,null,5,"|",null,"|","|","|","|",null,"M.2 SSD 480 GB",null,{"$f":"IF($P$10=5,1,\"\")","v":""}]
[6,null,null,null,null,null,null,null,6,"|",null,"|","|","|","|",null,"M.2 SSD 960 GB",null,{"$f":"IF($P$10=6,1,\"\")","v":""}]
[null,null,null,null,null,null,null,null,null,"|",null,"|","|","|","|"]
[null,null,null,null,null,null,null,null,null,"|",null,"|","|","|","|",null,"Drive 2 in Simatic IPC Slider (only with OS, if Drive 1 is unused) / Com"]
[1,null,null,null,null,null,null,null,null,{"$f":"IF(OR(AND($P$10=1)),\"#\",\"0\")","v":"0"},null,"|","|","|","|",null,"without 2nd mass-storage",null,{"$f":"IF($P$11=1,1,\"\")","v":1}]
[2,null,null,null,null,null,null,null,null,1,null,"|","|","|","|",null,"M.2 SSD 256 GB Eco",null,{"$f":"IF($P$11=2,1,\"\")","v":""}]
[3,null,null,null,null,null,null,null,null,2,null,"|","|","|","|",null,"M.2 SSD 512 GB Eco",null,{"$f":"IF($P$11=3,1,\"\")","v":""}]
[4,null,null,null,null,null,null,null,null,{"$f":"IF($P$10>1,\"3\",\"#\")","v":"3"},null,"|","|","|","|",null,"1 x Com (RS232/485/422)",null,{"$f":"IF($P$11=4,1,\"\")","v":""}]
[" ",null,null,null,null,null,null,null,null,null,null,"|","|","|","|"]
[null,null,null,null,null,null,null,null,null,null,null,"|","|","|","|",null,"Software configuration"]
[1,null,null,null,null,null,null,null,null,null,null,0,"|","|","|",null,"without operating system",null,{"$f":"IF($P$12=1,1,\"\")","v":1}]
[2,null,null,null,null,null,null,null,null,null,null,{"$f":"IF(OR(AND($P$10=1,$P$11=1),$P$7=4),\"#\",\"1\")","v":"1"},"|","|","|",null,"Windows 10 IoT Enterprise 2021 LTSC with processors Celeron, W-11155MLE, W-11555MLE",null,{"$f":"IF($P$12=2,1,\"\")","v":""}]
[3,null,null,null,null,null,null,null,null,null,null,{"$f":"IF(OR(AND($P$10=1,$P$11=1),$P$7<4),\"#\",\"2\")","v":"#"},"|","|","|",null,"Windows 10 IoT Enterprise 2021 LTSC with processor W-11865MLE",null,{"$f":"IF($P$12=3,1,\"\")","v":""}]
[4,null,null,null,null,null,null,null,null,null,null,{"$f":"IF(OR(AND($P$10=1,$P$11=1),$P$7<4),\"#\",\"7\")","v":"#"},"|","|","|",null,"SIMATIC Industrial OS",null,{"$f":"IF($P$12=4,1,\"\")","v":""}]
[null,null,null,null,null,null,null,null,null,null,null,null,"|","|","|"]
[null,null,null,null,null,null," ",null,null,null,null,null,"|","|","|",null,"Option 1"]
[1,null,null,null,null,null,null,null,null,null," ",null,"A","|","|",null,"pedestal mounting (expandable, flange below)",null,{"$f":"IF($P$13=1,1,\"\")","v":1}]
[2,null,null,null,null,null,null,null,null,null,null,null,"B","|","|",null,"support arm (expandable, round tube)",null,{"$f":"IF($P$13=2,1,\"\")","v":""}]
[3,null,null,null,null,null,null,null,null,null,null,null,"C","|","|",null,"support arm (not expandable, flange above) ",null,{"$f":"IF($P$13=3,1,\"\")","v":""}]
[null,null,null,null,null,null,null,null,null,null,null,null,null,"|","|"]
[null,null,null,null,null,null,null,null,null,null,null,null,null,"|","|",null,"Option 2"]
[1,null,null,null,null,null," "," "," "," "," "," "," ","A","|",null,"without USB-Stick (Restore-Image; D&D)",null,{"$f":"IF($P$14=1,1,\"\")","v":1}]
[2,null,null,null,null,null,null,null,null,null,null,null,null,{"$f":"IF(OR($P$12=4),\"#\",\"B\")","v":"B"},"|",null,"with USB-Stick (Restore-Image; D&D)",null,{"$f":"IF($P$14=2,1,\"\")","v":""}]
[null,null,null,null,null,null," "," "," "," "," "," "," "," ","|"," ",null,null," "]
[null,null,null,null,null,null," "," "," "," "," "," "," ",null,"|",null,"Power Supply"]
[1,null,null,null,null,null,null,null,null,null,null,null,null,null,0,null,"24V DC Industrial Powersupply (Premium, NAU, isolated)",null,{"$f":"IF($P$15=1,1,\"\")","v":1}]
[2,null,null,null,null,null,null,null,null,null,null,null,null,null,7,null,"24V DC Industry-power supply (NAU, isolated,with hold-up time) with ATEX/IECEx/UL HazLoc",null,{"$f":"IF($P$15=2,1,\"\")","v":""}]
[]
[null,null,null,null,null,null,null,null,null,null,null,null,null,null,null,null,"Base device",null,1]
[]
[null,null,null,null,null,null,null,null,null,null,null,null,null,null,null,null,null,"Total:"]
[]
[null,null,null,null,null,null,null,null,null,null,null,null,null,null,null,null,"ACCESSORI PER IPC e MONITOR PRO"]
[]
["Accessories:"]
["6ES7648-0EL00-0GA1",null,null,null,null,null,null,null,null,null,null,null,null,null,null,null,"SIMATIC IPC Slider for M.2 SSD, NO SSD"]
["6ES7648-0EL10-0GA3",null,null,null,null,null,null,null,null,null,null,null,null,null,null,null,"SIMATIC IPC Slider for M.2 SSD, 256 GB Eco disk"]
["6ES7648-0EL20-0GA3",null,null,null,null,null,null,null,null,null,null,null,null,null,null,null,"SIMATIC IPC Slider for M.2 SSD, 512 GB Eco disk"]
["6ES7648-2AK70-0RA0",null,null,null,null,null,null,null,null,null,null,null,null,null,null,null,"RAM Module 8 GB (1x 8 GB) DDR4 3200, SDRAM, SO-DIMM"]
["6ES7648-2AK80-0RA0",null,null,null,null,null,null,null,null,null,null,null,null,null,null,null,"RAM Module  16 GB (1x 16 GB) DDR4 3200, SDRAM, SO-DIMM"]
["6ES7648-2AK81-0RA0",null,null,null,null,null,null,null,null,null,null,null,null,null,null,null,"RAM Module  32 GB (1x 32 GB) DDR4 3200, SDRAM, SO-DIMM"]
["6ES7648-2AK80-1RA0",null,null,null,null,null,null,null,null,null,null,null,null,null,null,null,"RAM Module  16 GB (1x 16 GB) DDR4 3200, SDRAM, SO-DIMM mit ECC"]
["6ES7648-2AK81-1RA0",null,null,null,null,null,null,null,null,null,null,null,null,null,null,null,"RAM Module  32 GB (1x 32 GB) DDR4 3200, SDRAM, SO-DIMM mit ECC"]

{"sheet":"IPC677E (Panel PC)","index":30,"n_rows":100,"n_cols":19,"rows_kept":100,"cut":false,"hidden":false,"merged":[]}
["SIMATIC IPC677E"]
[null,null,null,null,null,null,null,null,null,null,null,null,null,null,null,null,{"$f":"IF(E47,F47,\"\")&IF(E65,F65,\"\")&IF(E66,F66,\"\")&IF(E67,F67,\"\")&IF(E68,F68,\"\")&IF(E35,F35,\"\")&IF(E42,F42,\"\")&IF(E82,F82,\"\")&IF(E69,F69,\"\")&IF(E70,F70,\"\")","v":""}]
[]
[]
["6AV7",2,6,1,"-",{"$f":"INDEX(F22:F24,P6)","v":0},{"$f":"INDEX(G27:G32,P7)","v":"A"},{"$f":"INDEX(H35:H47,P8)","v":"A"},{"$f":"INDEX(I50:I54,P9)","v":0},{"$f":"INDEX(J57:J62,P10)","v":0},"-",{"$f":"INDEX(L65:L71,P11)","v":8},{"$f":"INDEX(M74:M78,P12)","v":"A"},{"$f":"INDEX(N81:N83,P13)","v":"A"},{"$f":"INDEX(O86:O88,P14)","v":0},null,"SIMATIC IPC677E (Panel PC)",{"$f":"A5&B5&C5&D5&E5&F5&G5&H5&I5&J5&K5&L5&M5&N5&O5","v":"6AV7261-0AA00-8AA0"}]
[null,null,null,null,null,"|","|","|","|","|",null,"|","|","|","|",1,{"$f":"INDEX(Q22:Q24,P6)","v":"19\" Multitouch (1920 x 1080)"}]
[null,null,null,null,null,"|","|","|","|","|",null,"|","|","|","|",1,{"$f":"INDEX(Q27:Q32,P7)","v":"Celeron G4900 (2C/2T, 3.1GHz, 2MB Cache; VT-d);"}]
[null,null,null,null,null,"|","|","|","|","|",null,"|","|","|","|",1,{"$f":"INDEX(Q35:Q47,P8)","v":"HDD 2.5\" SATA 320 GB internal;"}]
[null,null,null,null,null,"|","|","|","|","|",null,"|","|","|","|",1,{"$f":"INDEX(Q50:Q54,P9)","v":"4 GB DDR4-2666 (1x4);"}]
[null,null,null,null,null,"|","|","|","|","|",null,"|","|","|","|",1,{"$f":"INDEX(Q57:Q62,P10)","v":"DC 24V industrial power supply;"}]
[null,null,null,null,null,"|","|","|","|","|",null,"|","|","|","|",7,{"$f":"INDEX(Q65:Q71,P11)","v":"Without operating system;"}]
[null,null,null,null,null,"|","|","|","|","|",null,"|","|","|","|",1,{"$f":"INDEX(Q74:Q78,P12)","v":"Without extension (SW);"}]
[null,null,null,null,null,"|","|","|","|","|",null,"|","|","|","|",1,{"$f":"INDEX(Q81:Q83,P13)","v":"Without extension (HW);"}]
[null,null,null,null,null,"|","|","|","|","|",null,"|","|","|","|",1,{"$f":"INDEX(Q86:Q88,P14)","v":"2x PCI;"}]
[null,null,null,null,null,"|","|","|","|","|",null,"|","|","|","|",null,"UHD Graphics on board; 2x DP; 1x DVI-D;","Link utili"]
[null,null,null,null,null,"|","|","|","|","|",null,"|","|","|","|",null,"3x Gigabit Ethernet (IE/PN) RJ45;","Certificati"]
[null,null,null,null,null,"|","|","|","|","|",null,"|","|","|","|",null,"6x USB 3.1 Gen.2; 1x serial (COM1);","Datasheet"]
[null,null,null,null,null,"|","|","|","|","|",null,"|","|","|","|",null,"RAID-Controller on board;","Manuale"]
[null,null,null,null,null,"|","|","|","|","|",null,"|","|","|","|",null,"Watchdog; Temperature/Fan monitoring; ","CAD 2D/3D"]
[null,null,null,null,null,"|","|","|","|","|",null,"|","|","|","|"]
[null,null,null,null,null,"|","|","|","|","|",null,"|","|","|","|",null,"Front Panel"]
[null,null,null,null,null,0,"|","|","|","|",null,"|","|","|","|",null,"19\" Multitouch (1920 x 1080)",null,{"$f":"IF($P$6=1,\"X\",\"\")","v":"X"}]
[null,null,null,null,null,1,"|","|","|","|",null,"|","|","|","|",null,"22\" Multitouch (1920 x 1080)",null,{"$f":"IF($P$6=2,\"X\",\"\")","v":""}]
[null,null,null,null,null,2,"|","|","|","|",null,"|","|","|","|",null,"24\" Multitouch (1920 x 1080)",null,{"$f":"IF($P$6=3,\"X\",\"\")","v":""}]
[null,null,null,null,null,null,"|","|","|","|",null,"|","|","|","|"]
[null,null,null,null,null,null,"|","|","|","|",null,"|","|","|","|",null,"Processor"]
[null,null,null,null,null,null,"A","|","|","|",null,"|","|","|","|",null,"Celeron G4900 (2C/2T, 3.1GHz, 2MB Cache; VT-d);",null,{"$f":"IF($P$7=1,\"X\",\"\")","v":"X"}]
[null,null,null,null,null,null,"B","|","|","|",null,"|","|","|","|",null,"Celeron G4900 (2C/2T, 3.1GHz, 2MB Cache; VT-d); NVRAM;",null,{"$f":"IF($P$7=2,\"X\",\"\")","v":""}]
[null,null,null,null,null,null,"C","|","|","|",null,"|","|","|","|",null,"Core i3-8100 (4C/4T, 3.6GHz, 6MB Cache, VT-d);",null,{"$f":"IF($P$7=3,\"X\",\"\")","v":""}]
[null,null,null,null,null,null,"D","|","|","|",null,"|","|","|","|",null,"Core i3-8100 (4C/4T, 3.6GHz, 6MB Cache, VT-d); NVRAM;",null,{"$f":"IF($P$7=4,\"X\",\"\")","v":""}]
[null,null,null,null,null,null,"G","|","|","|",null,"|","|","|","|",null,"Core i7-8700 (6C/12T, 3.2(4.6)GHz, 12MB Cache, VT-d, AMT);",null,{"$f":"IF($P$7=5,\"X\",\"\")","v":""}]
[null,null,null,null,null,null,"H","|","|","|",null,"|","|","|","|",null,"Core i7-8700 (6C/12T, 3.2(4.6)GHz, 12MB Cache, VT-d, AMT); NVRAM;",null,{"$f":"IF($P$7=6,\"X\",\"\")","v":""}]
[null,null,null,null,null,null,null,"|","|","|",null,"|","|","|","|"]
[null," ",null,null,null,null,null,"|","|","|",null,"|","|","|","|",null,"Drive"]
[null,null,null,null,{"$f":"IF(AND(OR($H$5=\"A\"),$J$5=6),1,0)","v":0},"\"This configuration has no UL Hazloc certification\"",null,"A","|","|",null,"|","|","|","|",null,"HDD 2.5\" SATA 320 GB internal;",null,{"$f":"IF($P$8=1,\"X\",\"\")","v":"X"}]
[null,null,null,null,null,null,null,"C","|","|",null,"|","|","|","|",null,"SSD 2.5\" SATA 480 GB internal;",null,{"$f":"IF($P$8=2,\"X\",\"\")","v":""}]
[null,null,null,null,null,null,null,"D","|","|",null,"|","|","|","|",null,"SSD 2.5\" SATA 960 GB internal;",null,{"$f":"IF($P$8=3,\"X\",\"\")","v":""}]
[null,null,null,null,null,null,null,"E","|","|",null,"|","|","|","|",null,"RAID1 2x SSD 2.5\" SATA 480 GB internal;",null,{"$f":"IF($P$8=4,\"X\",\"\")","v":""}]
[null,null,null,null,null,null,null,"G","|","|",null,"|","|","|","|",null,"RAID1 2x SSD 2.5\" SATA 480 GB in removable drive bay;",null,{"$f":"IF($P$8=5,\"X\",\"\")","v":""}]
[null,null,null,null,null,null,null,"H","|","|",null,"|","|","|","|",null,"RAID1 2x SSD 2.5\" SATA 960 GB in removable drive bay;",null,{"$f":"IF($P$8=6,\"X\",\"\")","v":""}]
[null,null,null,null,null,null,null,"J","|","|",null,"|","|","|","|",null,"M.2 SSD NVMe 512 GB;",null,{"$f":"IF($P$8=7,\"X\",\"\")","v":""}]
[null,null,null,null,{"$f":"IF(AND(OR($H$5=\"K\"),$J$5=6),1,0)","v":0},"\"This configuration has no UL Hazloc certification\"",null,"K","|","|",null,"|","|","|","|",null,"M.2 SSD NVMe 512 GB; HDD 2.5\" SATA 320 GB internal;",null,{"$f":"IF($P$8=8,\"X\",\"\")","v":""}]
[null,null,null,null,null,null,null,"L","|","|",null,"|","|","|","|",null,"M.2 SSD NVMe 512 GB; SSD 2.5\" SATA 480 GB internal;",null,{"$f":"IF($P$8=9,\"X\",\"\")","v":""}]
[null,null,null,null,null,null,null,"M","|","|",null,"|","|","|","|",null,"M.2 SSD NVMe 512 GB; SSD 2.5\" SATA 960 GB internal;",null,{"$f":"IF($P$8=10,\"X\",\"\")","v":""}]
[null,null,null,null,null,null,null,"Q","|","|",null,"|","|","|","|",null,"M.2 SSD NVMe 512 GB; RAID1 2x SSD 2.5\" SATA 480 GB in removable drive bay;",null,{"$f":"IF($P$8=11,\"X\",\"\")","v":""}]
[null,null,null,null,null,null,null,"S","|","|",null,"|","|","|","|",null,"M.2 SSD NVMe 512 GB; 2 removable drive bays w.o. media;",null,{"$f":"IF($P$8=12,\"X\",\"\")","v":""}]
[null,null,null,null,{"$f":"IF(AND(OR($L$5<8),$H$5=\"Y\"),1,0)","v":0},"\"Operating System requires a Mass Storage\"; "," ","Y","|","|",null,"|","|","|","|",null,"Without Drives (internal: 2x 2.5\" mounting options; incl. cables);",null,{"$f":"IF($P$8=13,\"X\",\"\")","v":""}]
[null,null,null,null,null,null,null,null,"|","|",null,"|","|","|","|"]
[null,null,null,null,null,null,null,null,"|","|",null,"|","|","|","|",null,"Main memory"]
[null,null,null,null,null,null,null,null,0,"|",null,"|","|","|","|",null,"4 GB DDR4-2666 (1x4);",null,{"$f":"IF($P$9=1,\"X\",\"\")","v":"X"}]
[null,null,null,null,null,null,null,null,1,"|",null,"|","|","|","|",null,"8 GB DDR4-2666 (2x4);",null,{"$f":"IF($P$9=2,\"X\",\"\")","v":""}]
[null,null,null,null,null,null,null,null,2,"|",null,"|","|","|","|",null,"16 GB DDR4-2666 (2x8);",null,{"$f":"IF($P$9=3,\"X\",\"\")","v":""}]
[null,null,null,null,null,null,null,null,3,"|",null,"|","|","|","|",null,"32 GB DDR4-2666 (2x16);",null,{"$f":"IF($P$9=4,\"X\",\"\")","v":""}]
[null,null,null,null,null,null,null,null,4,"|",null,"|","|","|","|",null,"64 GB DDR4-2666 (4x16);",null,{"$f":"IF($P$9=5,\"X\",\"\")","v":""}]
[null,null,null,null,null,null,null,null,null,"|",null,"|","|","|","|"]
[null,null,null,null,null,null,null,null,null,"|",null,"|","|","|","|",null,"Country specific type/ power supply"]
[null,null,null,null,null,null,null,null,null,0,null,"|","|","|","|",null,"DC 24V industrial power supply;",null,{"$f":"IF($P$10=1,\"X\",\"\")","v":"X"}]
[null,null,null,null,null,null,null,null,null,1,null,"|","|","|","|",null,"AC 110/230V Industrial PS with Namur; without power cord;",null,{"$f":"IF($P$10=2,\"X\",\"\")","v":""}]
[null,null,null,null,null,null,null,null,null,2,null,"|","|","|","|",null,"AC 110/230V Industrial PS with Namur; power cord Europe;",null,{"$f":"IF($P$10=3,\"X\",\"\")","v":""}]
[null,null,null,null,null,null,null,null,null,3,null,"|","|","|","|",null,"AC 110/230V Industrial PS with Namur; power cord US;",null,{"$f":"IF($P$10=4,\"X\",\"\")","v":""}]
[null,null,null,null,null,null,null,null,null,4,null,"|","|","|","|",null,"AC 110/230V Industrial PS with Namur; power cord China;",null,{"$f":"IF($P$10=5,\"X\",\"\")","v":""}]
[null,null,null,null,null,null,null,null,null,6,null,"|","|","|","|",null,"DC 24V industrial power supply; System certification ATEX/IECEx/UL HazLoc;",null,{"$f":"IF($P$10=6,\"X\",\"\")","v":""}]
[null,null,null,null,null,null,null,null,null,null,null,"|","|","|","|"]
[null,null,null,null,null,null,null,null,null,null,null,"|","|","|","|",null,"Operating system"]
[null,null,null,null,{"$f":"IF(AND(OR($G$5>\"E\"),$L$5=0),1,0)","v":0},"\"Wrong Windows 10 LTSB 2016 for Core-i7\"; "," ",null,null,null,null,0,"|","|","|",null,"Windows 10 Enterprise 2016 LTSB, 64Bit, MUI (En, Ger, Fr, It, Sp), for Celeron and i3;",null,{"$f":"IF($P$11=1,\"X\",\"\")","v":""}]
[null,null,null,null,{"$f":"IF(AND(OR($G$5<\"G\"),$L$5=1),1,0)","v":0},"\"Wrong  Windows 10 LTSB 2016 for Celeron/Core-i3\"; "," ",null,null,null,null,1,"|","|","|",null,"Windows 10 Enterprise 2016 LTSB, 64Bit, MUI (En, Ger, Fr, It, Sp), for Core i7;",null,{"$f":"IF($P$11=2,\"X\",\"\")","v":""}]
[null,null,null,null,{"$f":"IF(AND(OR($G$5>\"E\"),$L$5=2),1,0)","v":0},"\"Wrong  Windows 10 LTSC 2019 for Core-i7\"; "," ",null,null,null,null,2,"|","|","|",null,"Windows 10 IoT Enterprise 2019 LTSC, 64Bit, MUI (En, Ger, Fr, It, Sp), for Celeron and i3;",null,{"$f":"IF($P$11=3,\"X\",\"\")","v":""}]
[null,null,null,null,{"$f":"IF(AND(OR($G$5<\"G\"),$L$5=3),1,0)","v":0},"\"Wrong  Windows 10 LTSC 2019 for Celeron/Core-i3\"; "," "," "," "," ",null,3,"|","|","|",null,"Windows 10 IoT Enterprise 2019 LTSC, 64Bit, MUI (En, Ger, Fr, It, Sp), for Core i7;",null,{"$f":"IF($P$11=4,\"X\",\"\")","v":""}]
["new",null,null,null,{"$f":"IF(AND(OR($G$5>\"D\"),$L$5=4),1,0)","v":0},"\"Wrong  Windows 10 LTSC 2021 for Core-i7\"; "," "," "," "," ",null,4,"|","|","|",null,"Windows 10 IoT Enterprise 2021 LTSC, 64Bit, MUI (en,de,fr,it,sp); for Celeron and i3;",null,{"$f":"IF($P$11=5,\"X\",\"\")","v":""}]
["new",null,null,null,{"$f":"IF(AND(OR($G$5<\"G\"),$L$5=5),1,0)","v":0},"\"Wrong  Windows 10 LTSC 2021 for Celeron/Core-i3\"; "," "," "," "," ",null,5,"|","|","|",null,"Windows 10 IoT Enterprise 2021 LTSC, 64Bit, MUI (en,de,fr,it,sp); for Core i7;",null,{"$f":"IF($P$11=6,\"X\",\"\")","v":""}]
[null,null,null,null,null,null," "," "," "," ",null,8,"|","|","|",null,"Without operating system;",null,{"$f":"IF($P$11=7,\"X\",\"\")","v":"X"}]
[null,null,null,null,null,null," "," "," "," ",null,null,"|","|","|"]
[null,null,null,null,null,null,null,null,null,null,null,null,"|","|","|",null,"Extension (SW)"]
[null,null,null,null,null,null,null,null,null,null,null,null,"A","|","|",null,"Without extension (SW);",null,{"$f":"IF($P$12=1,\"X\",\"\")","v":"X"}]
[null,null,null,null,null,null,null,null,null,null,null,null,"B","|","|",null,"SIMATIC IPC DiagMonitor added; ",null,{"$f":"IF($P$12=2,\"X\",\"\")","v":""}]
[null,null,null,null,null,null,null,null,null,null,null,null,"C","|","|",null,"SIMATIC IPC Image&Partition Creator added; ",null,{"$f":"IF($P$12=3,\"X\",\"\")","v":""}]
[null,null,null,null,null,null,null,null,null,null,null,null,"D","|","|",null,"SIMATIC IPC DiagMonitor, Image&Partition Creator added; ",null,{"$f":"IF($P$12=4,\"X\",\"\")","v":""}]
[null,null,null,null,null,null,null,null,null,null,null,null,"X","|","|",null,"TPM-Module;",null,{"$f":"IF($P$12=5,\"X\",\"\")","v":""}]
[null,null,null,null,null,null,null,null,null,null,null,null,null,"|","|"]
[null,null,null,null,null,null,null,null,null,null,null,null,null,"|","|",null,"Extension (HW)"]
[null,null,null,null,null,null,null,null,null,null,null,null,null,"A","|",null,"Without extension (HW);",null,{"$f":"IF($P$13=1,\"X\",\"\")","v":"X"}]
[null,null,null,null,{"$f":"IF(AND(OR($N$5=\"B\"),$J$5=6),1,0)","v":0},"\"This configuration has no UL Hazloc certification\"",null,null,null,null,null,null,null,"B","|",null,"2x USB 2.0 (1 slot occupied);",null,{"$f":"IF($P$13=2,\"X\",\"\")","v":""}]
[null,null,null,null,{"$f":"IF(AND(OR($N$5=\"B\"),$J$5=5),1,0)","v":0},"This configuration has no UL Hazloc certification",null,null,null,null,null,null,null,"C","|",null,"Device without CMOS Battery (CR2450N);",null,{"$f":"IF($P$13=3,\"X\",\"\")","v":""}]
[null,null,null,null,null,null,null,null,null,null,null,null,null,null,"|"]
[null,null,null,null,null,null,null,null,null,null,null,null,null,null,"|",null,"Extension (HW)"]
[null,null,null,null,null,null,null,null,null,null,null,null,null,null,0,null,"2x PCI;",null,{"$f":"IF($P$14=1,\"X\",\"\")","v":"X"}]
[null,null,null,null,null,null,null,null,null,null,null,null,null,null,1,null,"1x PCIe (x16), 1x PCI;",null,{"$f":"IF($P$14=2,\"X\",\"\")","v":""}]
[null,null,null,null,null,null,null,null,null,null,null,null,null,null,2,null,"2x PCIe (x16, x4);",null,{"$f":"IF($P$14=3,\"X\",\"\")","v":""}]
[]
[null,null,null,null,null,null,null,null,null,null,null,null,null,null,null,null,"Base unit ",null,"X"]
[]
[{"$f":"A$5","v":"6AV7"},2,6,1,"-",0,{"$f":"G5","v":"A"},{"$f":"H5","v":"A"},{"$f":"I5","v":0},{"$f":"J5","v":0},"-",{"$f":"L5","v":8},{"$f":"M5","v":"A"},{"$f":"N5","v":"A"},{"$f":"O5","v":0},null,null,"Total:"]
[]
[]
["Accessories:"]
[]
[null,null,null,null,null,null,null,null,null,null,null,null,null,null,null,null,"Memory Extension"]
["6ES7648-2AL60-0QA0",null,null,null,null,null,null,null,null,null,null,null,null,null,null,null,"4 GB DDR4 DIMM (1x 4); "]
["6ES7648-2AL70-0QA0",null,null,null,null,null,null,null,null,null,null,null,null,null,null,null,"8 GB DDR4 DIMM (1x 8); "]
["6ES7648-2AL80-0QA0",null,null,null,null,null,null,null,null,null,null,null,null,null,null,null,"16 GB DDR4 DIMM (1x 16); "]

{"sheet":"IPC MD-57A","index":31,"n_rows":97,"n_cols":19,"rows_kept":97,"cut":false,"hidden":false,"merged":[[0,17,1,17]]}
["SIMATIC IPC MD-57A",null,null,null,null,null,null,null,null,null,null,null,null,null,null,null,{"$f":"$A$3&$B$3&$C$3&$D$3&$E$3&$F$3&$G$3&$H$3&$I$3&$J$3&$K$3&$L$3&$M$3&$N$3&$O$3","v":"6ES7730-0AA02-0NA0"}]
[null,null,null,null,null,null,null,null,null,null,null,null,null,null,null,null,{"$f":"$A$3&$B$3&$C$3&$D$3&$E$3&$F$3&$G$3&$H$3&$I$3&$J$3&$K$3&$L$3&$M$3&$N$3&$O$3","v":"6ES7730-0AA02-0NA0"}]
["6ES7",7,3,0,"-",{"$f":"VLOOKUP(P5,A15:Q16,6,TRUE)","v":0},{"$f":"VLOOKUP(P6,A19:Q19,7,TRUE)","v":"A"},{"$f":"VLOOKUP(P7,A22:Q24,8,TRUE)","v":"A"},{"$f":"VLOOKUP(P8,A27:Q29,9,TRUE)","v":0},{"$f":"VLOOKUP(P9,A32:Q41,10,TRUE)","v":2},"-",{"$f":"VLOOKUP(P10,A43:Q46,12,FALSE)","v":0},{"$f":"VLOOKUP(P11,A50:Q52,13,TRUE)","v":"N"},{"$f":"VLOOKUP(P12,A55:Q57,14,TRUE)","v":"A"},0,null,"SIMATIC IPC MD-57A",{"$f":"T(Q2)","v":"6ES7730-0AA02-0NA0"}]
[null,null,null,null,null,"|","|","|","|","|",null,"|","|","|","|",1,"15,6\" Display, Full HD (1920 x 1080); 2x USB-C Gen 4; 3x USB-A Gen 3.2 x 2: 1x USB-A Gen 2; 2x RJ45 1GbE; Fingerprint sensor; WiFi 6E & Bluetooth V5.3; "]
[null,null,null,null,null,"|","|","|","|","|",null,"|","|","|","|",1,{"$f":"VLOOKUP(P5,A15:Q16,17,FALSE)","v":"Intel® Core™ i5 -12600HE Processor (16 Threads, 18MB Cache, up to 4.50 GHz); "}," "]
[null,null,null,null,null,"|","|","|","|","|",null,"|","|","|","|",1,{"$f":"VLOOKUP(P6,A19:Q19,17,FALSE)","v":"Intel® Iris® Xe Graphics eligible; "}]
[null,null,null,null,null,"|","|","|","|","|",null,"|","|","|","|",1,{"$f":"VLOOKUP(P7,A22:Q24,17,FALSE)","v":"16 GB DDR5 SDRAM SO-DIMM (1x16GB); "}]
[null,null,null,null,null,"|","|","|","|","|",null,"|","|","|","|",1,{"$f":"VLOOKUP(P8,A27:Q29,17,FALSE)","v":"512 GB; "}]
[null,null,null,null,null,"|","|","|","|","|",null,"|","|","|","|",3,{"$f":"IF(P9=1,Q32,)&IF(P9=2,Q33,)&IF(P9=3,Q34,)&IF(P9=4,Q35,)&IF(P9=5,Q36,)&IF(P9=6,Q37,)&IF(P9=7,Q39,)","v":"Power cable with AC plug: Italy; keyboard: QWERTY; "},"Link utili"]
[null,null,null,null,null,"|","|","|","|","|",null,"|","|","|","|",1,{"$f":"VLOOKUP(P10,A43:Q46,17,FALSE)","v":"without Slider; "},"Certificati"]
[null,null,null,null,null,"|","|","|","|","|",null,"|","|","|","|",3,{"$f":"VLOOKUP(P11,A50:Q52,17,FALSE)","v":"without operating system (without USB-Stick); "}]
[null,null,null,null,null,"|","|","|","|","|",null,"|","|","|","|",1,{"$f":"VLOOKUP(P12,A55:Q57,17,FALSE)","v":"Trial: STEP 7 Prof. Combo, WinCC Adv., Safety Adv. (TIA Portal & Distr. Safety)"},"Manuale"]
[null,null,null,null,null,"|","|","|","|","|",null,"|","|","|","|",1,{"$f":"IF(P13=1,Q60,)","v":"V19"},"CAD 2D/3D"]
[null,null,null,null,null,"|","|","|","|","|",null,"|","|","|","|",null,"Processor"]
[1,null,null,null,null,0,"|","|","|","|",null,"|","|","|","|",null,"Intel® Core™ i5 -12600HE Processor (16 Threads, 18MB Cache, up to 4.50 GHz); ",null,{"$f":"IF($P$5=1,1,\"\")","v":1}]
[2,null,null,null,null,1,"|","|","|","|",null,"|","|","|","|",null,"Intel® Core™ i7-12800HE Processor (20 Threads, 24MB Cache, up to 4.60 GHz); ",null,{"$f":"IF($P$5=2,1,\"\")","v":""}]
[null,null,null,null,null,null,"|","|","|","|",null,"|","|","|","|"]
[null,null,null,null,null,null,"|","|","|","|",null,"|","|","|","|",null,"Graphic Card"]
[1,null,null,null,null,null,"A","|","|","|",null,"|","|","|","|",null,"Intel® Iris® Xe Graphics eligible; ",null,{"$f":"IF($P$6=1,1,\"\")","v":1}]
[" ",null,null,null,null,null,null,"|","|","|",null,"|","|","|","|"]
[null,null,null,null,null,null," ","|","|","|",null,"|","|","|","|",null,"RAM"]
[1,null,null,null,null,null,null,"A","|","|",null,"|","|","|","|",null,"16 GB DDR5 SDRAM SO-DIMM (1x16GB); ",null,{"$f":"IF($P$7=1,1,\"\")","v":1}]
[2,null,null,null,null,null,null,"B","|","|",null,"|","|","|","|",null,"32 GB DDR5 SDRAM SO-DIMM (1x32GB); ",null,{"$f":"IF($P$7=2,1,\"\")","v":""}]
[3,null,null,null,null,null,null,"C","|","|",null,"|","|","|","|",null,"64 GB DDR5 SDRAM SO-DIMM (2x32GB); ",null,{"$f":"IF($P$7=3,1,\"\")","v":""}]
[null,null,null,null,null,null,null,null,"|","|",null,"|","|","|","|"]
[null,null,null,null,null,null,null,null,"|","|",null,"|","|","|","|",null,"internal M.2 NVME"]
[1,null,null,null,null,null,null,null,0,"|",null,"|","|","|","|",null,"512 GB; ",null,{"$f":"IF($P$8=1,1,\"\")","v":1}]
[2," ",null,null," ",null,null,null,1,"|",null,"|","|","|","|",null,"1 TB; ",null,{"$f":"IF($P$8=2,1,\"\")","v":""}]
[3,null,null,null," ",null,null,null,2,"|",null,"|","|","|","|",null,"2 TB; ",null,{"$f":"IF($P$8=3,1,\"\")","v":""}]
[null,null,null,null,null,null,null,null,null,"|",null,"|","|","|","|"]
[null,null,null,null,null,null,null,null,null,"|",null,"|","|","|","|",null,"Power Connector and Keyboard"]
[1,null,null,null,null,null,null,null,null,{"$f":"IF($P$8<8,\"0\",\"#\")","v":"0"},null,"|","|","|","|",null,"Power cable with AC plug: Europe; keyboard: QWERTZ; ",null,{"$f":"IF($P$9=1,1,\"\")","v":""}]
[2,null,null,null,null,null,null,null,null,1,null,"|","|","|","|",null,"Power cable with AC plug: Europe; keyboard: AZERTY (France); ",null,{"$f":"IF($P$9=2,1,\"\")","v":""}]
[3,null,null,null,null,null,null,null,null,2,null,"|","|","|","|",null,"Power cable with AC plug: Italy; keyboard: QWERTY; ",null,{"$f":"IF($P$9=3,1,\"\")","v":1}]
[4,null,null,null,null,null,null,null,null,3,null,"|","|","|","|",null,"Power cable with AC plug: Switzerland; Keyboard: QWERTZ; ",null,{"$f":"IF($P$9=4,1,\"\")","v":""}]
[5,"FCC not completed yet",null,null,null,null,null,null,null,4,null,"|","|","|","|",null,"Power cable with AC plug: USA; keyboard: QWERTY; ",null,{"$f":"IF($P$9=5,1,\"\")","v":""}]
[6,null,null,null,null,null,null,null,null,5,null,"|","|","|","|",null,"Power cable with AC plug: UK; keyboard: QWERTY; ",null,{"$f":"IF($P$9=6,1,\"\")","v":""}]
[null,null,null,null,null,null,null,null,null,6,null,"|","|","|","|",null,"Power cable with AC plug: Europe; keyboard: QWERTY; "]
[7,null,null,null,null,null,null,null,null,7,null,"|","|","|","|",null,"without power cable; keyboard: QWERTY; ",null,{"$f":"IF($P$9=7,1,\"\")","v":""}]
[null,null,null,null,null,null,null,null,null,8,null,"|","|","|","|",null,"Power cable with AC plug: India; approval for India (BIS); keyboard: QWERTY; "]
[" ",null,null,null,null,null,null,null,null,null,null,"|","|","|","|"]
[null,null,null,null,null,null,null,null,null,null,null,"|","|","|","|",null,"Slider / NVME"]
[1,null,null,null,null,null,null,null,null,null,null,0,"|","|","|",null,"without Slider; ",null,{"$f":"IF($P$10=1,1,\"\")","v":1}]
[2,null,null,null,null,null,null,null,null,null,null,1,"|","|","|",null,"512 GB NVMe SSD Slider; ",null,{"$f":"IF($P$10=2,1,\"\")","v":""}]
[3,null,null,null,null,null,null,null,null,null,null,2,"|","|","|",null,"1 TB NVMe SSD Slider; ",null,{"$f":"IF($P$10=3,1,\"\")","v":""}]
[4,null,null,null,null,null,null,null,null,null,null,3,"|","|","|",null,"2 TB NVMe SSD Slider; ",null,{"$f":"IF($P$10=4,1,\"\")","v":""}]
[null,null,null,null,null,null,null,null,null,null,null,null,"|","|","|"]
[null,null,null,null,null,null,null,null,null,null,null,null,"|","|","|"]
[null,null,null,null,null,null," ",null,null,null,null,null,"|","|","|",null,"Operating System"]
[1,null,null,null,null,null,null,null,null,null," ",null,"A","|","|",null,"Windows 11 IoT Enterprise (Version 22H2) 64-Bit; ",null,{"$f":"IF($P$11=1,1,\"\")","v":""}]
[2,null,null,null,null,null,null,null,null,null,null,null,"B","|","|",null,"Windows 11 IoT Enterprise (Version 22H2) 64-Bit; with Recovery USB-Stick; ",null,{"$f":"IF($P$11=2,1,\"\")","v":""}]
[3,null,null,null,null,null,null,null,null,null," ",null,"N","|","|",null,"without operating system (without USB-Stick); ",null,{"$f":"IF($P$11=3,1,\"\")","v":1}]
[null,null,null,null,null,null,null,null,null,null,null,null,null,"|","|"]
[null,null,null,null,null,null,null,null,null,null,null,null,null,"|","|",null,"SIMATIC Software Licenses"]
[1,null,null,null,null,null," "," "," "," "," "," "," ","A","|",null,"Trial: STEP 7 Prof. Combo, WinCC Adv., Safety Adv. (TIA Portal & Distr. Safety)",null,{"$f":"IF($P$12=1,1,\"\")","v":1}]
[2,null,null,null,null,null," "," "," "," "," "," "," ","B","|",null,"STEP 7 & WinCC & Safety in TIA Portal: STEP 7 Prof., WinCC Adv., Safety Adv.",null,{"$f":"IF($P$12=2,1,\"\")","v":""}]
[3,null,null,null,null,null," "," "," "," "," "," "," ","C","|",null,"STEP 7 & WinCC & Safety Combo: STEP 7 Prof. Combo, WinCC Adv., Safety Adv. Combo (TIA Portal & Distrib.)",null,{"$f":"IF($P$12=3,1,\"\")","v":""}]
[null,null,null,null,null,null," "," "," "," "," "," "," "," ","|"," "]
[null,null,null,null,null,null,null,null,null,null,null,null,null,null,"|",null,"Version of SIMATIC Software license"]
[null,null,null,null,null,null,null,null,null,null,null,null,null,null,0,null,"V19"]
[]
[null,null,null,null,null,null,null,null,null,null,null,null,null,null,null,null,null,"Grundgerät",1]
[]
[null,null,null,null,null,null,null,null,null,null,null,null,null,null,null,null,null,"Summe:"]
[]
[]
[]
["Zubehör:"]
[]
["6ES7798-0DA02-0XA0",null,null,null,null,null,null,null,null,null,null,null,null,null,null,null,"Backpack for IPC MD-57A and Field PG M6/M5/M4"]
["6ES7648-0EK00-0GA1",null,null,null,null,null,null,null,null,null,null,null,null,null,null,null,"SIMATIC IPC Slider (long) for M.2 SSD, w/o SSD"]
["6ES7648-0EK20-0GA3",null,null,null,null,null,null,null,null,null,null,null,null,null,null,null,"SIMATIC IPC Slider (long) for M.2 SSD, with 512 GB Eco"]
["6ES7648-0EK30-0GA3",null,null,null,null,null,null,null,null,null,null,null,null,null,null,null,"SIMATIC IPC Slider (long) for M.2 SSD, with 1 TB Eco"]
["6ES7648-0EK40-0GA3",null,null,null,null,null,null,null,null,null,null,null,null,null,null,null,"SIMATIC IPC Slider (long) for M.2 SSD, with 2 TB Eco"]
[]
["6ES7648-2AN80-0SA0",null,null,null,null,null,null,null,null,null,null,null,null,null,null,null,"Memory module 16 GB (1x 16 GB) DDR5, SDRAM, SO-DIMM"]
["6ES7648-2AN81-0SA0",null,null,null,null,null,null,null,null,null,null,null,null,null,null,null,"Memory module  32 GB (1x 32 GB) DDR5, SDRAM, SO-DIMM"]
[]
["6ES7798-0AA11-0XA0",null,null,null,null,null,null,null,null,null,null,null,null,null,null,null,"Battery Kit, Lithium-Ion battery pack IPC MD-57A (6 months warranty)"]
["6ES7798-0GA05-0XA1",null,null,null,null,null,null,null,null,null,null,null,null,null,null,null,"Power adapter for IPC MD-57A"]
["6ES7900-0AA00-0XA0",null,null,null,null,null,null,null,null,null,null,null,null,null,null,null,"AC IEC cable, Germany and others, 90° male to 180° female (3-pole, C13)"]
["6ES7900-0BA00-0XA0",null,null,null,null,null,null,null,null,null,null,null,null,null,null,null,"AC IEC cable, United Kingdom, 90° male BS 1363 to 180° female (3-pole, C13)"]
["6ES7900-0CA00-0XA0",null,null,null,null,null,null,null,null,null,null,null,null,null,null,null,"AC IEC cable, Switzerland, 180° male SEV 1011 to 180° female (3-pole, C13)"]
["6ES7900-0DA00-0XA0",null,null,null,null,null,null,null,null,null,null,null,null,null,null,null,"AC IEC cable, USA, Canada and others, 180° male to 180° female (3-pole, C13) "]
["6ES7900-0EA00-0XA0",null,null,null,null,null,null,null,null,null,null,null,null,null,null,null,"AC IEC cable, Italy Type L and others, 180° male to 180° female (3-pole, C13)"]
["6ES7900-0GA00-0XA0",null,null,null,null,null,null,null,null,null,null,null,null,null,null,null,"AC IEC cable, Indiia 90° male to female (3-pole, C13)"]
[]
["6ES7901-0BF00-0AA0",null,null,null,null,null,null,null,null,null,null,null,null,null,null,null,"MPI-cable"]
[]
["6ES7810-5CC04-0YE2",null,null,null,null,null,null,null,null,null,null,null,null,null,null,null,"STEP 7 Prof. Combo Software Update Service (SUS) Standard"]
["6ES7810-5CC04-0YY2",null,null,null,null,null,null,null,null,null,null,null,null,null,null,null,"STEP 7 Prof. Combo Software Update Service (SUS) Download"]
["6ES7822-1AA00-0YL5",null,null,null,null,null,null,null,null,null,null,null,null,null,null,null,"STEP 7 Prof. in TIA Portal Software Update Service (SUS) Standard"]
["6ES7822-1AE00-0YY0",null,null,null,null,null,null,null,null,null,null,null,null,null,null,null,"STEP 7 Prof. in TIA Portal Software Update Service (SUS) Download"]
["6AV6613-0AA00-0AL0",null,null,null,null,null,null,null,null,null,null,null,null,null,null,null,"WinCC Adv. Software Update Service (SUS) Standard"]
["6AV6613-0AA00-0AY0",null,null,null,null,null,null,null,null,null,null,null,null,null,null,null,"WinCC Adv. Software Update Service (SUS) Download"]
["6ES7833-1FC00-0YX2",null,null,null,null,null,null,null,null,null,null,null,null,null,null,null,"SIMATIC STEP 7 Safety Advanced Software Update Service (SUS) Standard"]
["6ES7833-1FC00-0YY0",null,null,null,null,null,null,null,null,null,null,null,null,null,null,null,"SIMATIC STEP 7 Safety Advanced Software Update Service (SUS) Download"]

{"sheet":"IPC MD-34A","index":32,"n_rows":32,"n_cols":21,"rows_kept":32,"cut":false,"hidden":false,"merged":[]}
["SIMATIC IPC MD-34A (Tablet PC)",null,null,null,null,null,null,null,null,null,null,null,null,null,null,null,"Rimpiazza Tablet  ITP1000",null,null,"Listino"]
[null,null,null,null,null,null,null,null,null,null,null,null,null,null,null,null,"SIMATIC IPC MD-34A"]
[null,null,null,null,null,null,null,null,null,null,null,null,null,null,null,null,"10'' Multitouch",null,null,null,"Link utili"]
[null,null,null,null,null,null,null,null,null,null,null,null,null,null,null,null,"Intel Core i5",null,null,null,"Certificati"]
[null,null,null,null,null,null,null,null,null,null,null,null,null,null,null,null,"Windows 10 IoT 2021 LTSC",null,null,null,"Datasheet"]
[null,null,null,null,null,null,null,null,null,null,null,null,null,null,null,null,"Wifi 6, Bluetooth v5.3",null,null,null,"Manuale"]
[null,null,null,null,null,null,null,null,null,null,null,null,null,null,null,null,"Power cord is excluded from the package. Please order power cord based on the socket of selling country",null,null,null,"CAD 2D/3D"]
["Order number",null,null,null,null,null,null,null,null,null,null,null,null,null,null,null,"Description"]
["6AV7880-4AA01-0AA1",null,null,null,null,null,null,null,null,null,null,null,null,null,null,null,"Entry version, 1280*800, 350 nits, 256GB SSD, 8GB RAM",null,null,2944]
["6AV7880-4BA01-0AA1",null,null,null,null,null,null,null,null,null,null,null,null,null,null,null,"Entry Plus version, 1280*800, 350 nits, 256GB SSD, 8GB RAM, Barcode Reader, 4G/LTE",null,null,3651]
["6AV7880-4CB01-1AA1",null,null,null,null,null,null,null,null,null,null,null,null,null,null,null,"High End version, 1920*1200, 800 nits, 512GB SSD, 32GB RAM, Barcode Reader, HF RFID 4G/LTE, GPS",null,null,4476]
["6AV7880-4DB01-1AA1",null,null,null,null,null,null,null,null,null,null,null,null,null,null,null,"Automation version, 1280*800, 350 nits, 256GB SSD, 16GB RAM, HF RFID",null,null,3298]
["6AV7880-4EB01-1AA1",null,null,null,null,null,null,null,null,null,null,null,null,null,null,null,"Outdoor 1920*1200, 800 nits, 512GB SSD, 16GB RAM, 4G/LTE, GPS",null,null,4005]
[null,null,null,null,null,null,null,null,null,null,null,null,null,null,null,null,null,null,null,""]
[null,null,null,null,null,null,null,null,null,null,null,null,null,null,null,null,null,null,null,""]
["Accessories:",null,null,null,null,null,null,null,null,null,null,null,null,null,null,null,"Due to the mechanical design of RFID module, High-end and Automation versions are not adaptable to Vehicle dock. "]
["Order number",null,null,null,null,null,null,null,null,null,null,null,null,null,null,null,"Description",null,null,""]
["6AV7676-1AC00-0AA0",null,null,null,null,null,null,null,null,null,null,null,null,null,null,null,"SIMATIC IPC MD-34A Accessory, Desk Dock, 1*LAN 10/100 MBits/s, 4*USB 2.0, 1*RS-232, 1*VGA, 19V DC-in ",null,null,413]
["6AV7676-1AC10-0AA0",null,null,null,null,null,null,null,null,null,null,null,null,null,null,null,"Vehicle Dock, 1*LAN 10/100 MBits/s, 4*USB 2.0, 1*RS-232, 1* VGA, 9-36V DC-in",null,null,637]
["6AV7676-3AC00-0AA0",null,null,null,null,null,null,null,null,null,null,null,null,null,null,null,"2-Bay Battery Charger",null,null,354]
["6AV7676-3AC10-0AA0",null,null,null,null,null,null,null,null,null,null,null,null,null,null,null,"Battery Kit, Lithium Ion batteries approx. 3500 mAh (6 months warranty)",null,null,201]
["6AV7676-4AC00-0AA0",null,null,null,null,null,null,null,null,null,null,null,null,null,null,null,"Shoulder Strap",null,null,95]
["6AV7676-4AC10-0AA0",null,null,null,null,null,null,null,null,null,null,null,null,null,null,null,"Hand Strap",null,null,59]
["Power Cord ",null,null,null,null,null,null,null,null,null,null,null,null,null,null,null,null,null,null,""]
["Order number",null,null,null,null,null,null,null,null,null,null,null,null,null,null,null,"Description",null,null,""]
["6ES7900-5AA00-0XA0",null,null,null,null,null,null,null,null,null,null,null,null,null,null,null,"Power Cord 3m (DE/FR/SP/NE/BE/SW/AU/FL)",null,null,16]
["6ES7900-5BA00-0XA0",null,null,null,null,null,null,null,null,null,null,null,null,null,null,null,"Power Cord 3m (GB)",null,null,16]
["6ES7900-5CA00-0XA0",null,null,null,null,null,null,null,null,null,null,null,null,null,null,null,"Power Cord 3m (Swissland)",null,null,16]
["6ES7900-5DA00-0XA0",null,null,null,null,null,null,null,null,null,null,null,null,null,null,null,"Power Cord 3m (USA)",null,null,16]
["6ES7900-5EA00-0XA0",null,null,null,null,null,null,null,null,null,null,null,null,null,null,null,"Power Cord 3m (Italy)",null,null,16]
["6ES7900-5FA00-0XA0",null,null,null,null,null,null,null,null,null,null,null,null,null,null,null,"Power Cord 3m (China)",null,null,16]
["6ES7900-5GA00-0XA0",null,null,null,null,null,null,null,null,null,null,null,null,null,null,null,"Power Cord 3m (India)",null,null,15]

{"sheet":"IFP V2","index":33,"n_rows":86,"n_cols":21,"rows_kept":86,"cut":false,"hidden":false,"merged":[]}
["SIMATIC Industrial Flat Panel Monitor V2\n (Multitouch, FullHD)",null,null,null,null,null,null,null,null,null,null,null,null,null,null,null,null,null,null,null,"."]
[]
[]
[{"$f":"IF(LEN($A$58)>1,$A$58,$A$56&\".  \"&$A$57)","v":"This configuration is a stock item.  "}]
["6AV7",8,6,3,"-",{"$f":"VLOOKUP(P6,A17:Q22,6,FALSE)","v":"5"},"M","A",{"$f":"VLOOKUP(P8,$A$26:$Q$32,9,FALSE)","v":"1"},{"$f":"VLOOKUP(P8,$A$26:$Q$32,10,FALSE)","v":4},"-",2,{"$f":"VLOOKUP(P9,$A$43:$Q$44,13,FALSE)","v":"A"},"A",0,null,{"$f":"\"SIMATIC Industrial Flat Panel Monitor \"&\"IFP\"&LEFT(VLOOKUP(P6,A17:Q22,17,TRUE),2)&\"00 \"&IF($P$9>1,\"PRO\",\"\")&IF($P$8=3, \" ETH\",\"\")","v":"SIMATIC Industrial Flat Panel Monitor IFP1500 "},{"$f":"A5&B5&C5&D5&E5&F5&G5&H5&I5&J5&K5&L5&M5&N5&O5","v":"6AV7863-5MA14-2AA0"}]
[null,null,null,null,null,"|",null,null,"|","|",null,null,"|",null,null,2,{"$f":"Q16&\" \"&VLOOKUP(P6,A17:Q22,17,TRUE)","v":"Display Size 15 PRO\" (FullHD, 1920x1080) "}]
[null,null,null,null,null,"|",null,null,"|","|",null,null,"|",null,null,2,{"$f":"VLOOKUP(P7,A38:Q39,17,FALSE)","v":"extended up to 100m distance possible (HDBaseT; no cables included))"}]
[null,null,null,null,null,"|",null,null,"|","|",null,null,"|",null,null,4,{"$f":"IF(ISNUMBER(FIND(\"(\",VLOOKUP($P$8,$A$26:$Q$32,17,FALSE))),LEFT(VLOOKUP($P$8,$A$26:$Q$32,17,FALSE),FIND(\"(\",VLOOKUP($P$8,$A$26:$Q$32,17,FALSE))-1),VLOOKUP($P$8,$A$26:$Q$32,17,FALSE))","v":"PRO suitable for pedestal mounting/extension components "}]
[null,null,null,null,null,"|",null,null,"|","|",null,null,"|",null,null,1,{"$f":"VLOOKUP($P$9,$A$43:$Q$44,17,FALSE)","v":"standard Siemens design"},"Link utili"]
[null,null,null,null,null,"|",null,null,"|","|",null,null,"|",null,null,null,{"$f":"IF($P$7=1,\"DVI-D, DisplayPort  Interface\",\" DisplayPort  Interface\")","v":" DisplayPort  Interface"},"Certificati"]
[null,null,null,null,null,"|",null,null,"|","|",null,null,"|",null,null,null,"dimmable, 2x USB at back","Datasheet"]
[null,null,null,null,null,"|",null,null,"|","|",null,null,"|",null,null,null,"EX Zone 2/22; marine certifications/approvals   (in preparation only built in devices)","Manuale"]
[null,null,null,null,null,"|",null,null,"|","|",null,null,"|",null,null,null,"24 Volt DC, galvanical isolated","CAD 2D/3D"]
[null,null,null,null,null,"|",null,null,"|","|",null,null,"|"]
[null,null,null,null,null,"|",null,null,"|","|",null,null,"|"]
[null,null,null,null,null,"|",null,null,"|","|",null,null,"|",null,null,null,"Display Size"]
[1,null,null,null,null,{"$f":"IF(AND(P7<>3),\"1\",\"?\")","v":"1"},null,null,"|","|",null,null,"|",null,null,null,"12\" (1280x800) ",null,{"$f":"IF($P$6=A17,1,\"\")","v":""}]
[2,null,null,null,null,{"$f":"IF(P8=2,\"#\",\"5\")","v":"5"},null,null,"|","|",null,null,"|",null,null,null,"15 PRO\" (FullHD, 1920x1080) ",null,{"$f":"IF($P$6=A18,1,\"\")","v":1}]
[3,null,null,null,null,5,null,null,"|","|",null,null,"|",null,null,null,"15\" (FullHD, 1920x1080) ",null,{"$f":"IF($P$6=$A19,1,\"\")","v":""}]
[4,null,null,null,null,6,null,null,"|","|",null,null,"|",null,null,null,"19\" (FullHD, 1920x1080)",null,{"$f":"IF($P$6=$A20,1,\"\")","v":""}]
[5,null,null,null,null,4,null,null,"|","|",null,null,"|",null,null,null,"22\" (FullHD, 1920x1080) ",null,{"$f":"IF($P$6=$A21,1,\"\")","v":""}]
[6,null,null,null,null,7,null,null,"|","|",null,null,"|",null,null,null,"24\" (FullHD, 1920x1080) ",null,{"$f":"IF($P$6=$A22,1,\"\")","v":""}]
[6,3,3,3,3,"|",3,3,"|","|",3,null,"|",null,3]
[null,null,null,null,null,"|",null,null,"|","|",null,null,"|"]
[null,null,null,null,null,"|",null,null,"|","|",null,null,"|",null,null,null,"Mounting Options"]
[1,null,null,null,null,"|",null,null,0,0,null,null,"|",null,null,null,"Flush-mount",null,{"$f":"IF($P$8<=3,1,\"\")","v":""}]
[2,null,null,null,null,"|",null,null,1,0,null,null,"|",null,null,null,"Flush-mount",null,{"$f":"IF($P$8<=3,1,\"\")","v":""}]
[3,null,null,null,null,"|",null,null,2,0,null,null,"|",null,null,null,"Flush-mount",null,{"$f":"IF($P$8<=3,1,\"\")","v":""}]
[4,null,null,null,null,"|",null,null,{"$f":"IF(P6=3,\"#\",\"1\")","v":"1"},4,null,null,"|",null,null,null,"PRO suitable for pedestal mounting/extension components (flange below)",null,{"$f":"IF($P$8=A29,1,\"\")","v":1}]
[5,null,null,null,null,"|",null,null,{"$f":"IF(P6=3,\"#\",\"1\")","v":"1"},5,null,null,"|",null,null,null,"PRO suitable for support arm w/o extension components (flange above)",null,{"$f":"IF($P$8=A30,1,\"\")","v":""}]
[6,null,null,null,null,"|",null,null,{"$f":"IF(P6=3,\"#\",\"1\")","v":"1"},6,null,null,"|",null,null,null,"PRO suitable for support arm and extension components (round tube)",null,{"$f":"IF($P$8=A31,1,\"\")","v":""}]
[7,null,null,null,null,7,null,null,1,7,null,null,"|",null,null,null,"PRO PORTRAIT suitable for support arm and extension components (round tube)",null,{"$f":"IF($P$8=A32,1,\"\")","v":""}]
[null,null,null,null,null,null,null,null,"|","|",null,null,"|"]
[null,null,null,null,null,null,null,null,"|","|",null,null,"|"]
[null,null,null,null,null,null,null,null,"|","|",null,null,"|"]
[null,null,null,null,null,null,null,null,"|","|",null,null,"|"]
[null,null,null,null,null,null,null,null,"|","|",null,null,"|",null,null,null,"Special functions"]
[1,null,null,null,null,null,null,null,0,"|",null,null,"|",null,null,null,"standard up to 5m distance possible (DP/USB cable 2m included)",null,{"$f":"IF($P$7=A38,1,\"\")","v":""}]
[2,null,null,null,null,null,null,null,1,"|",null,null,"|",null,null,null,"extended up to 100m distance possible (HDBaseT; no cables included))",null,{"$f":"IF($P$7=A39,1,\"\")","v":1}]
[null,null,null,null,null,null,null,null,null,null,null,null,"|"]
[null,null,null,null,null,null,null,null,null,null,null,null,"|"]
[null,null,null,null,null,null,null,null,null,null,null,null,"|",null,null,null,"Design"]
[1,null,null,null,null,null,null,null,null,null,null,null,"A",null,null,null,"standard Siemens design",null,{"$f":"IF($P$9=A43,1,\"\")","v":1}]
[2,null,null,null,null,null,null,null,null,null,null,null,"N",null,null,null,"neutral design, no brand",null,{"$f":"IF($P$9=A44,1,\"\")","v":""}]
[]
[]
[]
[]
[]
[]
[]
[]
[{"$f":"A5","v":"6AV7"},{"$f":"B5","v":8},{"$f":"C5","v":6},{"$f":"D5","v":3},"-",{"$f":"F5","v":"5"},{"$f":"G5","v":"M"},{"$f":"H5","v":"A"},{"$f":"I5","v":"1"},{"$f":"J5","v":4},"-",{"$f":"L5","v":2},{"$f":"M5","v":"A"},{"$f":"N5","v":"A"},{"$f":"O5","v":0},null,null,"Total:"]
[]
[]
[{"$f":"IF(ISNUMBER(FIND(\"?\",R5)),\"Sorry! This configuration is not available\",\"This configuration is a stock item\")","v":"This configuration is a stock item"}]
[{"$f":"IF($P$8=2,\"remember ordering suitable cables for transceiver\",\"\")","v":""}]
[]
[]
["Options:"]
["6AV7860-3PA00-0AA0",null,null,null,null,null,null,null,null,null,null,null,null,null,null,null,"AC Power Supply module for IFP V2 100-240V AC to 24V DC 60W ; not suitable for PRO devices"]
[]
["Accessories:for standard types up to 5m"]
["6AV7860-0BH30-0AA0",null,null,null,null,null,null,null,null,null,null,null,null,null,null,null,"DVI-D-cable industrial grade 3m"]
["6AV7860-0BH50-0AA0",null,null,null,null,null,null,null,null,null,null,null,null,null,null,null,"DVI-D-cable industrial grade 5m"]
["6AV7860-0CH30-0AA0",null,null,null,null,null,null,null,null,null,null,null,null,null,null,null,"USB-cable industrial grade 3m"]
["6AV7860-0CH50-0AA0",null,null,null,null,null,null,null,null,null,null,null,null,null,null,null,"USB-cable industrial grade 5m"]
["6AV7860-0DH30-0AA0",null,null,null,null,null,null,null,null,null,null,null,null,null,null,null,"DisplayPort-cable industrial grade 3m"]
["6AV7860-0DH50-0AA0",null,null,null,null,null,null,null,null,null,null,null,null,null,null,null,"DisplayPort-cable industrial grade 5m"]
[]
["Accessories:for extended types (HDBaseT)"]
["6AV7860-1EX21-0AB1",null,null,null,null,null,null,null,null,null,null,null,null,null,null,null,"Set of Cable 10m (Cat6 Cable ;Transceiver HDBaseT; Mounting accessories, USB/DP cable)"]
["6AV7860-1EX21-5AB1",null,null,null,null,null,null,null,null,null,null,null,null,null,null,null,"Set of Cable 15m (Cat6 Cable ;Transceiver HDBaseT; Mounting accessories, USB/DP cable)"]
["6AV7860-1EX22-0AB1",null,null,null,null,null,null,null,null,null,null,null,null,null,null,null,"Set of Cable 20m (Cat6 Cable ;Transceiver HDBaseT; Mounting accessories, USB/DP cable)"]
["6AV7860-1EX23-0AB1",null,null,null,null,null,null,null,null,null,null,null,null,null,null,null,"Set of Cable 30m (Cat6 Cable ;Transceiver HDBaseT; Mounting accessories, USB/DP cable)"]
["6XV1878-2C               ",null,null,null,null,null,null,null,null,null,null,null,null,null,null,null,"CAT6A Cable, available length, min 20m , max 1000m, unconfigured, without plugs "]
["6AV7860-1EY00-0AA0",null,null,null,null,null,null,null,null,null,null,null,null,null,null,null,"Plugs CAT6 for cable self configuring, 2 pieces "]
[]
["Replacement parts from cable kits"]
["6AV7860-3EH00-0AA0",null,null,null,null,null,null,null,null,null,null,null,null,null,null,null,"Transceiver Modul (HDBaseT, without cable, with mounting accessory, usb/dp cable 0,5m)"]
["6AV7860-0EH01-0AA0",null,null,null,null,null,null,null,null,null,null,null,null,null,null,null,"CAT6 cable 10m for HDBaseT tested"]
["6AV7860-0EH01-5AA0",null,null,null,null,null,null,null,null,null,null,null,null,null,null,null,"CAT6 cable 15m for HDBaseT tested"]
["6AV7860-0EH02-0AA0",null,null,null,null,null,null,null,null,null,null,null,null,null,null,null,"CAT6 cable 20m for HDBaseT tested"]
["6AV7860-0EH03-0AA0",null,null,null,null,null,null,null,null,null,null,null,null,null,null,null,"CAT6 cable 30m for HDBaseT tested"]
[]
[null,null,null,null,null,null,null,null,null,null,null,null,null,null,null,null,"ACCESSORI PER IPC e MONITOR PRO"]

{"sheet":"IFP Basic","index":34,"n_rows":26,"n_cols":19,"rows_kept":26,"cut":false,"hidden":false,"merged":[]}
["SIMATIC IFP Basic",null,null,null,null,null,null,null,null,null,null,null,null,null,null,null,"I Cavi USB e Display Port NON sono inclusi"]
[]
[]
[]
["6AV7",8,6,2,"-",2,"B",{"$f":"IF(P6=1,H14,IF(P6=2,H15,IF(P6=3,H16,IF(P6=4,H17,))))","v":"C"},0,0,"-",0,"A","A",0,null,{"$f":"\"SIMATIC IFP\"&IF(P6=1,\"1200\",)&IF(P6=2,\"1500\",)&IF(P6=3,\"1900\",)&IF(P6=4,\"2200\",)&\" Basic\"","v":"SIMATIC IFP1200 Basic"},{"$f":"$A$5&$B$5&$C$5&$D$5&$E$5&$F$5&$G$5&$H$5&$I$5&$J$5&$K$5&$L$5&$M$5&$N$5&$O$5","v":"6AV7862-2BC00-0AA0"}]
[null,null,null,null,null,null,null,null,null,null,null,null,null,null,null,1,{"$f":"\"Display size: \"&IF(P6=1,Q14,)&IF(P6=2,Q15,)&IF(P6=3,Q16,)&IF(P6=4,Q17,)","v":"Display size: 12\" (resolution: 1280x800)"}]
[null,null,null,null,null,null,null,null,null,null,null,null,null,null,null,null,"Graphic interfaces; 1 x DP, 1 x VGA","Link utili"]
[null,null,null,null,null,null,null,null,null,null,null,null,null,null,null,null,"Operating function: Touchscreen (analog-resistive)","Certificati"]
[null,null,null,null,null,null,null,null,null,null,null,null,null,null,null,null,"Power supply; 24V DC","Datasheet"]
[null,null,null,null,null,null,null,null,null,null,null,null,null,null,null,null,"Interfaces; 2 x USB2.0 (downstream); 1 x USB (for Touch)","Manuale"]
[null,null,null,null,null,null,null,null,null,null,null,null,null,null,null,null,null,"CAD 2D/3D"]
[]
[null," ",null,null,null,null,null,null,null,null,null,null,null,null,null,null,"Display size"]
[null," ",null,null,null,null,null,"C",null,null,null,null,null,null,null,null,"12\" (resolution: 1280x800)",null,{"$f":"IF($P$6=1,\"X\",\"\")","v":"X"}]
[null," ",null,null,null,null,null,"D",null,null,null,null,null,null,null,null,"15\" (resolution 1366x768)",null,{"$f":"IF($P$6=2,\"X\",\"\")","v":""}]
[null," ",null,null,null,null,null,"E",null,null,null,null,null,null,null,null,"19\" (resolution 1366x768)",null,{"$f":"IF($P$6=3,\"X\",\"\")","v":""}]
[null,null,null,null,null,null,null,"F",null,null,null,null,null,null,null,null,"22\" (resolution 1920x1080)",null,{"$f":"IF($P$6=4,\"X\",\"\")","v":""}]
[null,null,null,null,null,null,null,null,null,null,null," "]
[]
[]
[]
["Accessories:"]
["6AV7860-0CH30-0AA0",null,null,null,null,null,null,null,null,null,null,null,null,null,null,null,"USB-cable industrial grade 3m"]
["6AV7860-0CH50-0AA0",null,null,null,null,null,null,null,null,null,null,null,null,null,null,null,"USB-cable industrial grade 5m"]
["6AV7860-0DH30-0AA0",null,null,null,null,null,null,null,null,null,null,null,null,null,null,null,"DisplayPort-cable industrial grade 3m"]
["6AV7860-0DH50-0AA0",null,null,null,null,null,null,null,null,null,null,null,null,null,null,null,"DisplayPort-cable industrial grade 5m"]

{"sheet":"IFP V2 HYG","index":35,"n_rows":28,"n_cols":19,"rows_kept":28,"cut":false,"hidden":false,"merged":[]}
["SIMATIC Industrial Flat Panel HYG\n(Multitouch Full HD)"]
[]
[]
[]
["6AV7",2,8,5,"-",6,{"$f":"IF(P6=1,G14,IF(P6=2,G15,IF(P6=3,G16,IF(P6=4,G17,))))","v":"N"},"H",0,0,"-",0,"A",{"$f":"IF(P7=1,N22,)&IF(P7=2,N23,)","v":"A"},0,null,{"$f":"\"SIMATIC IFP \"&IF(P6=1,\"1200\",)&IF(P6=2,\"1500\",)&IF(P6=3,\"1900\",)&IF(P6=4,\"2200\",)&\" V2 ext. Hygienic\"","v":"SIMATIC IFP 1200 V2 ext. Hygienic"},{"$f":"$A$5&$B$5&$C$5&$D$5&$E$5&$F$5&$G$5&$H$5&$I$5&$J$5&$K$5&$L$5&$M$5&$N$5&$O$5","v":"6AV7285-6NH00-0AA0"}]
[null,null,null,null,null,null,"|",null,null,null,null,null,null,"|",null,1,{"$f":"\"Display size: \"&IF(P6=1,Q14,)&IF(P6=2,Q15,)&IF(P6=3,Q16,)&IF(P6=4,Q17,)","v":"Display size: 12\" (resolution: 1920x1080)"}]
[null,null,null,null,null,null,"|",null,null,null,null,null,null,"|",null,1,{"$f":"IF(P7=1,Q22,)&IF(P7=2,Q23,)","v":"standard Siemens design"},"Link utili"]
[null,null,null,null,null,null,"|",null,null,null,null,null,null,"|",null,null,"Graphic interfaces; 1 x DP, HDBase T","Certificati"]
[null,null,null,null,null,null,"|",null,null,null,null,null,null,"|",null,1,"Interfaces; USB on the rear side","Datasheet"]
[null,null,null,null,null,null,"|",null,null,null,null,null,null,"|",null,null,"Power supply; 24V DC","Manuale"]
[null,null,null,null,null,null,"|",null,null,null,null,null,null,"|",null,2,null,"CAD 2D/3D"]
[null,null,null,null,null,null,"|",null,null,null,null,null,null,"|"]
[null," ",null,null,null,null,"|",null,null,null,null,null,null,"|",null,null,"Display size"]
[null," ",null,null,null,null,"N",null,null,null,null,null,null,"|",null,null,"12\" (resolution: 1920x1080)",null,{"$f":"IF($P$6=1,\"X\",\"\")","v":"X"}]
[null," ",null,null,null,null,"H",null,null,null,null,null,null,"|",null,null,"15\" (resolution 1920x1080)",null,{"$f":"IF($P$6=2,\"X\",\"\")","v":""}]
[null," ",null,null,null,null,"K",null,null,null,null,null,null,"|",null,null,"19\" (resolution 1920x1080)",null,{"$f":"IF($P$6=3,\"X\",\"\")","v":""}]
[null,null,null,null,null,null,"L",null,null,null,null,null,null,"|",null,null,"22\" (resolution 1920x1080)",null,{"$f":"IF($P$6=4,\"X\",\"\")","v":""}]
[null,null,null,null,null,null,null,null,null,null,null," ",null,"|"]
[null,null,null,null,null,null,null,null,null,null,null,null,null,"|"]
[null,null,null,null,null,null,null,null,null,null,null,null,null,"|"]
[null,null,null,null,null,null,null,null,null,null,null,null,null,"|",null,null,"Design"]
[null,null,null,null,null,null,null,null,null,null,null,null,null,"A",null,null,"standard Siemens design",null,{"$f":"IF($P$7=1,\"X\",\"\")","v":"X"}]
[null,null,null,null,null,null,null,null,null,null,null,null,null,"B",null,null,"neutral design, no brand",null,{"$f":"IF($P$7=2,\"X\",\"\")","v":""}]
[]
[null,null,null,null,null,null,null,null,null,null,null,null,null,null,null,null,null,"Total:"]
[]
[]
["Accessories:"]

{"sheet":"ITC V3","index":36,"n_rows":40,"n_cols":19,"rows_kept":40,"cut":false,"hidden":false,"merged":[]}
["Industrial Thin Client SIMATIC ITC V3"]
[]
[null,null,null,null,null,null,null,null,null,null,null,null,null,null,null,null," "]
[]
["6AV6",6,4,6,"-",1,"B",{"$f":"VLOOKUP(P8,A17:Q20,8,TRUE)","v":"A"},{"$f":"VLOOKUP(P6,A23:Q25,9,TRUE)","v":1},{"$f":"VLOOKUP(P6,A23:Q25,10,TRUE)","v":5},"-",{"$f":"VLOOKUP(P6,A23:Q25,12,TRUE)","v":0},{"$f":"VLOOKUP(P7,A28:Q29,13,TRUE)","v":"A"},"A",0,null,{"$f":"\"SIMATIC ITC\"&LEFT(VLOOKUP(P6,A23:Q25,17,TRUE),2)&\"00\"&IF(P8>1,\" PRO\",\"\")&\" V3\"","v":"SIMATIC ITC1500 V3"},{"$f":"$A$5&$B$5&$C$5&$D$5&$E$5&$F$5&$G$5&$H$5&$I$5&$J$5&$K$5&$L$5&$M$5&$N$5&$O$5","v":"6AV6646-1BA15-0AA0"}]
[null,null,null,null,null,null,null,"|","|","|",null,null,"|",null,null,1,{"$f":"VLOOKUP(P6,A23:Q25,17,TRUE)","v":"15\" Display (1366x 768 Pixel)"}]
[null,null,null,null,null,null,null,"|","|","|",null,null,"|",null,null,1,{"$f":"VLOOKUP(P7,A28:Q29,17,TRUE)","v":"Standard"}]
[null,null,null,null,null,null,null,"|","|","|",null,null,"|",null,null,1,{"$f":"IF(P8=1,Q15,LEFT(Q15,34))","v":"Panel Mount"}]
[null,null,null,null,null,null,null,"|","|","|",null,null,"|",null,null,1,{"$f":"IF(P8=1,\"\",RIGHT(Q15,LEN(Q15)-35))","v":""}]
[null,null,null,null,null,null,null,"|","|","|",null,null,"|",null,null,1,"Multi-Touchscreen (capazitive-projective), Glass-front","Link utili"]
[null,null,null,null,null,null,null,"|","|","|",null,null,"|",null,null,1,0,"Certificati"]
[null,null,null,null,null,null,null,"|","|","|",null,null,"|",null,null,null,"Linux based System","Datasheet"]
[null,null,null,null,null,null,null,"|","|","|",null,null,"|",null,null,null,"supported protocols: RDP, VNC, Sm@rtServer,HTML5-Browser, Citrix","Manuale"]
[null,null,null,null,null,null,null,"|","|","|",null,null,"|",null,null,null,"WinCC OA, Sinumerik-Anbindung (planned)","CAD 2D/3D"]
[null,null,null,null,null,null,null,"|","|","|",null,null,"|",null,null,null,{"$f":"VLOOKUP($P$8,$A$17:$Q$20,17,TRUE)","v":"Panel Mount"}]
[null,null,null,null,null,null,null,"|","|","|",null,null,"|",null,null,null,"Mounting Options"]
[1,null,null,null,null,null,null,"A","|","|",null,null,"|",null,null,null,"Panel Mount",null,{"$f":"IF($P$8=A17,1,\"\")","v":1}]
[2,null,null,null,null,null,null,"B","|","|",null,null,"|",null,null,null,"fully enclosed acc. IP65, suitable for pedestal mounting/extension components (flange below)",null,{"$f":"IF($P$8=A18,1,\"\")","v":""}]
[3,null,null,null,null,null,null,"C","|","|",null,null,"|",null,null,null,"fully enclosed acc. IP65, suitable for support arm w/o extension components (flange above)",null,{"$f":"IF($P$8=A19,1,\"\")","v":""}]
[4,null,null,null,null,null,null,"D","|","|",null,null,"|",null,null,null,"fully enclosed acc. IP65, suitable for support arm and extension components (round tube)",null,{"$f":"IF($P$8=A20,1,\"\")","v":""}]
[null,null,null,null,null,null,null,null,"|","|",null,null,"|"]
[null,null,null,null,null,null,null,null,"|","|",null,null,"|",null,null,null,"Display Size"]
[1,null,null,null,null,null,null,null,1,5,"-",0,"|",null,null,null,"15\" Display (1366x 768 Pixel)",null,{"$f":"IF($P$6=A23,1,\"\")","v":1}]
[2,null,null,null,null,null,null,null,1,8,"-",0,"|",null,null,null,"19\" Display (1366x 768 Pixel)",null,{"$f":"IF($P$6=A24,1,\"\")","v":""}]
[3,null,null,null,null,null,null,null,2,2,"-",1,"|",null,null,null,"22\" Display (1920 x 1080 Pixel)",null,{"$f":"IF($P$6=A25,1,\"\")","v":""}]
[null,null,null,null,null,null,null,null,null,null,null,null,"|"]
[null,null,null,null,null,null,null,null,null,null,null,null,"|",null,null,null,"Design "]
[1,null,null,null,null,null,null,null,null,null,null,null,"A",null,null,null,"Standard",null,{"$f":"IF($P$7=A28,1,\"\")","v":1}]
[2,null,null,null,null,null,null,null,null,null,null,null,"N",null,null,null,"Neutral",null,{"$f":"IF($P$7=A29,1,\"\")","v":""}]
[]
[null,null,null,null,null,null,null,null,null,null,null,null,null,null,null,null,null,"Total:"]
[]
[]
["Accessories:"]
[]
[null,null,null,null,null,null,null,null,null,null,null,null,null,null,null,null,"Other"]
["6AV2181-8AV20-0AX0",null,null,null,null,null,null,null,null,null,null,null,null,null,null,null,"Touch pen system for multitouch devices"]
["6AV2181-8AV60-0AX0",null,null,null,null,null,null,null,null,null,null,null,null,null,null,null,"Touchpen caps - replacement caps for capacitive touch pen system"]
[]
[null,null,null,null,null,null,null,null,null,null,null,null,null,null,null,null,"ACCESSORI PER IPC e MONITOR PRO"]

{"sheet":"Power Plugs BX & PX","index":37,"n_rows":25,"n_cols":4,"rows_kept":25,"cut":false,"hidden":false,"merged":[]}
["Plugs for SIMATIC IPC BX- and PX"]
[]
["Grounded Continental European plug"]
["Region:\nD / F / NL / ESP / B / A / S / FIN",null,null,"For:\nSIMATIC IPC BX-/PX-"]
["MLFB:","6ES7 900-1AA00-0XA0"]
[]
["Grounded British plug"]
["Region:\nUK",null,null,"For:\nSIMATIC IPC BX-/PX-"]
["MLFB:","6ES7 900-1BA00-0XA0"]
[]
["Grounded Swiss plug"]
["Region:\nCH",null,null,"For:\nSIMATIC IPC BX-/PX-"]
["MLFB:","6ES7 900-1CA00-0XA0"]
[]
["Grounded North American and Japanese plug"]
["Region:\nUSA",null,null,"For:\nSIMATIC IPC BX-/PX-"]
["MLFB:","6ES7 900-1DA00-0XA0"]
[]
["Grounded Italian plug"]
["Region:\nItaly",null,null,"For:\nSIMATIC IPC BX-/PX-"]
["MLFB:","6ES7 900-1EA00-0XA0"]
[]
["Grounded Chinese plug"]
["Region:\nChina",null,null,"For:\nSIMATIC IPC BX-/PX-"]
["MLFB:","6ES7 900-1FA00-0XA0"]

{"sheet":"DIME IPC","index":38,"n_rows":34,"n_cols":9,"rows_kept":34,"cut":false,"hidden":false,"merged":[[4,3,4,5],[4,6,4,7],[18,3,18,5],[18,6,18,7],[28,3,28,5],[28,6,28,7]]}
[]
["Tabella Dimensioni Panel PC e Display"]
[]
[]
[null,null,null,"Dimensione IPC",null,null,"CORNICE"]
["TIPO IPC","Pollici","Single / Multitouch","Altezza","Larghezza ","Profondità","Altezza","Larghezza"]
["277E",7,"ST",146,190,77.3,158,214]
["277E",9,"ST",164,249,77.3,190,274]
["277E",12,"ST",219,308,72,241,330]
["277E/477E",15,"ST",289,394,73,310,415]
["277E/477E",19,"ST",317,463,82,337,483]
["477E",22,"ST",360,540,82,380,560]
["277E",12,"MT",209,297,76,227,315]
["277E/477E",15,"MT",239,380,76,257,398]
["277E/477E",19,"MT",276,446,76,294,464]
["477E",22,"MT",331,511,95,331,529]
["477E",24,"MT",345,567,95,363,585]
[]
[null,null,null,"Dimensione IPC",null,null,"CORNICE"]
["TIPO IPC","Pollici","Single / Multitouch","Altezza","Larghezza ","Profondità","Altezza","Larghezza"]
["277G",7,"MT",140,196,88,158,214]
["277G",10,"MT",187,162,86,205,280]
["277G/IFP V2",12,"MT",219,308,95,237,326]
["277G/PX-39A/IFP V2",15,"MT",239,380,95,257,398,"Valida anche per display Hygienics e thin client"]
["277G/PX-39A/IFP V2/677E",19,"MT",276,446,95,294,464,"Valida anche per display Hygienics e thin client"]
["277G/PX-39A/IFP V2/677E",22,"MT",331,511,95,331,529,"Valida anche per display Hygienics e thin client"]
["277G/PX-39A/IFP V2/677E",24,"MT",345,567,95,363,585,"Valida anche per display Hygienics e thin client"]
[]
[null,null,null,"Dimensione IPC",null,null,"CORNICE"]
["TIPO IPC","Pollici","Single / Multitouch","Altezza","Larghezza ","Profondità","Altezza","Larghezza"]
["377G/IFP Basic/PX-32A",12,"ST",206,300,92,226,320]
["377G/IFP Basic/PX-32A",15,"ST",239,387,100,259,406]
["377G/IFP Basic/PX-32A",19,"ST",278,453,100,331,473]
["377G/IFP Basic/PX-32A",22,"ST",315,521,100,335,540]

{"sheet":"IPC CPU BENCHMARK","index":39,"n_rows":89,"n_cols":9,"rows_kept":89,"cut":false,"hidden":false,"merged":[[9,7,18,14]]}
["Tabella comparativa prestazioni CPU"]
[]
[]
[null,null,null,"Processore","Punteggio","IPC"]
[null,null,null,"Atom E3815",184,"----"]
[null,null,null,"Atom E3826",304,"----"]
[null,null,null,"Atom E3825",378,"----"]
[null,null,null,"Celeron N2807",450,"227E / 277E"]
[null,null,null,"Atom E3827 ",460,"----"]
[null,null,null,"Celeron N2930",542,"227E / 277E",null,"Tabella delle prestazioni delle singole CPU. I dati sono indicativi e tratti dal sito https://www.cpubenchmark.net/"]
[null,null,null,"Celeron G3902",679,"427E / 477E"]
[null,null,null,"Atom E3930",878,"127E"]
[null,null,null,"Atom E3845 ",1058,"----"]
[null,null,null,"Celeron J1900",1137,"----"]
[null,null,null,"Celeron G3955U",1490,"----"]
[null,null,null,"Celeron 3965U",1692,"----"]
[null,null,null,"Atom X6211E",1695,"227G / 277G"]
[null,null,null,"Celeron G3900TE",1850,"----"]
[null,null,null,"Celeron 4305UE",1876,"----"]
[null,null,null,"Atom E3940",1960,"127E"]
[null,null,null,"Celeron G3900E",2034,"----"]
[null,null,null,"Core i3-4330",2098,"627D / 677D / 647D / 847E",null,null," https://www.cpubenchmark.net/"]
[null,null,null,"Atom E3950",2101,"----"]
[null,null,null,"Core i3-6102E",2349,"427E / 477E"]
[null,null,null,"Celeron G4900",2437,"----"]
[null,null,null,"Pentium G4400",2590,"347G / 527G / 547G"]
[null,null,null,"Core i3-7100U",2722,"----"]
[null,null,null,"Celeron 6600HLE",3022,"BX-39A/PX-39A"]
[null,null,null,"Core i5-4570",3106,"627D / 677D / 647D / 847E"]
[null,null,null,"Core i5-6500",3272,"347G / 527G / 547G"]
[null,null,null,"Core i3-6100E",3315,"----"]
[null,null,null,"Core i7-6600U",3469,"----"]
[null,null,null,"Core i7-7600U",3670,"----"]
[null,null,null,"Core i5-7300U",3751,"----"]
[null,null,null,"Core i5-6442EQ",3923,"427E / 477E"]
[null,null,null,"Atom X6413E",4070,"227G / 277G"]
[null,null,null,"Core i3-8145UE",4087,"----"]
[null,null,null,"Pentium G6400",4124,"RC-543A"]
[null,null,null,"Core i3-7101E",4430,"----"]
[null,null,null,"Core i3-9100TE",4501,"----"]
[null,null,null,"Core i7-8665UE",5048,"----"]
[null,null,null,"Core i5-6440EQ",5419,"----"]
[null,null,null,"Core i5-7440EQ",5711,"----"]
[null,null,null,"Core i5-8365UE",5797,"----"]
[null,null,null,"Core i5-7500",6065,"----"]
[null,null,null,"Xeon E3-1288L",6079,"627D / 677D / 647D / 847E"]
[null,null,null,"Xeon E3-1505L",6088,"427E / 477E"]
[null,null,null,"Core i3-8100",6164,"627E / 677E / 647E / 847E"]
[null,null,null,"Core i7-6700",6541,"347G / 527G / 547G"]
[null,null,null,"Core i7-6820EQ",6924,"----"]
[null,null,null,"Core i7-7820EQ",7453,"----"]
[null,null,null,"Xeon E3-1515MV5",7938,"----"]
[null,null,null,"Core i3-10100E",8229,"547J / RC543A"]
[null,null,null,"Xeon E3-1275",8421,"547G"]
[null,null,null,"Xeon W-11155MLE",8502,"BX-39A /PX-39A"]
[null,null,null,"Core i7-7700",8639,"----"]
[null,null,null,"Core i5-9500TE",9028,"----"]
[null,null,null,"Core i5-8500",9604,"627E / 677E / 647E / 847E"]
[null,null,null,"Core i5-1135G7",9751,"MD-34A"]
[null,null,null,"Core i5-10500TE",9960,"----"]
[null,null,null,"Core i7-9700TE",10740,"----"]
[null,null,null,"Core i3-11100HE",11289]
[null,null,null,"Core i5-10500E",11604,"547J / RC543A"]
[null,null,null,"Xeon W-11555MLE",12591,"BX-39A /PX-39A"]
[null,null,null,"Core i5-12500E",13572,"RC-545A / RW-545A"]
[null,null,null,"Xeon E-2176G",13643,"647E / 847E"]
[null,null,null,"Core i7-8700",13850,"627E / 677E / 647E / 847E"]
[null,null,null,"Xeon W-11865MLE",15958,"BX-39A /PX-39A"]
[null,null,null,"Core i7-10700TE",16332,"----"]
[null,null,null,"Core i7-10700E",17020,"547J / RC543A"]
[null,null,null,"Xeon E-2278GE",17706,"647E / 847E"]
[null,null,null,"Core i9-10900TE",17888,"----"]
[null,null,null,"Core i7-11850HE",18335,"----"]
[null,null,null,"Xeon W1270E",18635,"547J"]
[null,null,null,"Core i3-12100E",20250,"RC-545A / RW-545A"]
[null,null,null,"Core i9-10900E",20658,"547J / RC543A"]
[null,null,null,"Core i5-13500TE 65W21478",21478,"BX-56A / BX-59A"]
[null,null,null,"Core i7-13700TE 35W",23074,"BX-56A / BX-59A"]
[null,null,null,"Core i5-12600HE",24599,"MD-57A"]
[null,null,null,"Core i9-12900E",26666,"RC-545A / RW-545A"]
[null,null,null,"Core i5-13500E 65W",28035,"BX-56A / BX-59A"]
[null,null,null,"Core i7-12700E",29384,"RC-545A / RW-545A"]
[null,null,null,"Core i7-12800HE",29805,"MD-57A"]
[null,null,null,"Core i9-13900E 65W",34049,"BX-56A / BX-59A"]
[null,null,null,"Core i7-13700E 65W",34728,"BX-56A / BX-59A"]
[null,null,null,"AMD EPYC 9124 (2X)",43963,"RS-828A"]
[null,null,null,"AMD EPYC 9354 (2X)",67842,"RS-828A"]
[null,null,null,"AMD EPYC 9254 (2X)",68091,"RS-828A"]
[null,null,null,"AMD EPYC 9454 (2X)",95997,"RS-828A"]

{"sheet":"Accessori IPC PRO","index":40,"n_rows":56,"n_cols":2,"rows_kept":56,"cut":false,"hidden":false,"merged":[[0,0,0,1]]}
["ACCESSORI per Monitor e IPC PRO"]
[]
["Prodotto","Codice di ordinazione"]
[null,"(click per pagina di MALL)"]
["Extension Unit 12\" Hardwired","6AV7674-1LA31-0AA0"]
["Extension Unit 15\" Hardwired","6AV7674-1LA41-0AA0"]
["Extension Unit 19\" Hardwired","6AV7674-1LA51-0AA0"]
["Extension Unit 22\" Hardwired","6AV7674-1LA61-0AA0"]
["Extension Unit 24\" Hardwired","6AV7674-1LA71-0AA0"]
["Extension Unit 24\" Portrait Hardwired","6AV7674-1LA81-0AA0"]
["Extension Unit 12\" PROFINET","6AV7674-1LA32-0AA0"]
["Extension Unit 15\" PROFINET","6AV7674-1LA42-0AA0"]
["Extension Unit 19\" PROFINET","6AV7674-1LA52-0AA0"]
["Extension Unit 22\" PROFINET","6AV7674-1LA62-0AA0"]
["Extension Unit 24\" PROFINET","6AV7674-1LA72-0AA0"]
["Extension Unit 24\" Portrait PROFINET","6AV7674-1LA82-0AA0"]
["Extension Unit 12\" PROFIsafe","6AV7674-1LA33-0AA0"]
["Extension Unit 15\" PROFIsafe","6AV7674-1LA43-0AA0"]
["Extension Unit 19\" PROFIsafe","6AV7674-1LA53-0AA0"]
["Extension Unit 22\" PROFIsafe","6AV7674-1LA63-0AA0"]
["Extension Unit 24\" PROFIsafe","6AV7674-1LA73-0AA0"]
["Extension Unit 24\" Portrait PROFIsafe","6AV7674-1LA83-0AA0"]
["Extension Unit box 12\"","6AV7674-1LA30-0AA0"]
["Extension Unit box 15\"","6AV7674-1LA40-0AA0"]
["Extension Unit box 19\"","6AV7674-1LA50-0AA0"]
["Extension Unit box 22\"","6AV7674-1LA60-0AA0"]
["Extension Unit box 24\"","6AV7674-1LA70-0AA0"]
["EMERGENCY STOP pushbutton for Extension Unit","6AV7674-1MA00-0AA0"]
["Push button Safety","6AV7674-1MG50-0AA0"]
["Key switch Safety","6AV7674-1ME50-0AA0"]
["Illuminated pushbutton for Extension Unit (1x NO contact)","6AV7674-1MB00-0AA0"]
["Illuminated pushbutton for Extension Unit (1x NO contact and 1x NC contact)","6AV7674-1MG00-0AA0 "]
["Indicator light for Extension Unit","6AV7674-1MC00-0AA0"]
["Selector switch for Extension Unit","6AV7674-1MD00-0AA0"]
["Key switch for Extension Unit","6AV7674-1ME00-0AA0"]
["RFID reader SIMATIC RF1060R (ISO15693 und ISO14443 [MIFARE])","6GT2831-6AA50"]
["RFID reader SIMATIC RF1070R (ISO15693, ISO14443 [MIFARE] ,LEGIC PRIME)","6GT2831-6BA50"]
["RFID reader SIMATIC RF1040R (125 kHz; HITAG 1 und 2, EM4xxx,ISO15693 und ISO14443 [MIFARE])","6GT2831-6CA50"]
["USB interface for front mounting in extension unit","6AV7674-1MF00-0AA0"]
["Insert lables for self inscription","6AV7674-1LB30-0AA0"]
["Label holder for self inscription","6AV7674-1LB20-0AA0"]
["Round pipe adapter","6AV7674-1KF00-0AA0"]
["Basic adapter for 16:9 PRO devices (in silver)","6AV7674-1KA00-0AA0"]
["VESA 100/75 flange mount PRO (no IP65)","6AV6881-0AD56-0AA0"]
["VESA 75 adapter set ","6AV7674-0KE00-0AA0"]
["VESA 100 adapter set ","6AV7674-0KD00-0AA0"]
["USB for basic adapter","6AV7674-1LX00-0AA0"]
["Exchange adapter for PRO devices","6AV7674-1LB50-0AA0"]
["Round pipe seal for PRO devices","6AV7674-1LB40-0AA0"]
["Handles for PRO devices","6AV7674-1LB10-0AA0"]
["Keyboard tray for PRO devices","6AV7674-1NF01-0AA0"]
["Keyboard tray plate for PRO devices","6AV7674-1NG00-0AA0"]
["USB keyboard INT, KV25605 INOX with IP67 USB plug ","6AV6881-0AU14-1DB0"]
["USB keyboard GER, KV25605 INOX with IP67 USB plug","6AV6881-0AU14-0DB0 "]
["USB 2.0 cable IP67 to IP20 (incl. M20) 0,8m Type B","6AV6881-0AF22-0DC0 "]
["USB 2.0 cable IP67 to IP20 (incl. M20) 2,5m Type C","6AV6881-0AF22-0LC0"]

{"sheet":"SITOP DC UPS","index":41,"n_rows":56,"n_cols":9,"rows_kept":56,"cut":false,"hidden":false,"merged":[[33,1,33,6],[4,1,4,8],[8,1,8,8],[0,6,0,7]]}
["SITOP DC 24V UPS Selection Guide",null,null,null,null,null,"Link assorbimenti IPC"]
[]
[]
[]
["DC UPS with Capacitor","The right UPS solution for IPC applications at high temperatures (>40°C) with maintenance free capacitors and long lifetime (>8 years)"]
[" SITOP UPS500S Basis (kWs)\nMLFB: 6EP1933-2EC41 (2,5 kWs)\nMLFB: 6EP1933-2EC51 (5 kWs)",2.5,5,2.5,5,2.5,5,2.5,5]
["  SITOP UPS501S Expansion Module (kWs)\nMLFB: 6EP1935-5PG01 (5 kWs)","-","-","1x 5","1x 5","2x 5","2x 5","3x 5","3x 5"]
["Total Energy (kWs, Din Rail)",2.5,5,7.5,10,12.5,15,17.5,20]
["IPC (max. A in)","Buffer Time - Valid for new Capacitors at 25° C"]
["SIMATIC IPC127E (0,7A)","109 s","217 s","349 s","446 s","580 s","657 s","757 s","874 s"]
["SIMATIC IPC227D/E (1,4A)","54 s","109 s","174 s","223 s","290 s","329 s","379 s","437 s"]
["SIMATIC IPC277E 7\", 9\" (1,4A)","54 s","109 s","174 s","223 s","290 s","329 s","379 s","437 s"]
["SIMATIC IPC427C/D/E (1,9A)","40 s","80 s","128 s","164 s","214 s","242 s","279 s","322 s"]
["SIMATIC IPC327E (2,5A)","30 s","61 s","98 s","125 s","162 s","184 s","212 s","245 s"]
["SIMATIC IPC377E 12\", 15\", 19\" (2,5A)","30 s","61 s","98 s","125 s","162 s","184 s","212 s","245 s"]
["SIMATIC IPC277E 12\", 15\",19\" (3,0A)","25 s","51 s","81 s","104 s","135 s","153 s","177 s","204 s"]
["SIMATIC IPC477D/E (3,4A)","22 s","46 s","72 s","95 s","119 s","141 s","164 s","188 s"]
["SIMATIC IPC627C/D/E (3,5A)","22 s","45 s","70 s","93 s","115 s","137 s","159 s","183 s"]
["SIMATIC IPC827C/D/E (3,5A)","22 s","45 s","70 s","93 s","115 s","137 s","159 s","183 s"]
["SIMATIC IPC677C/D/E (4,8A)","16 s","32 s","51 s","68 s","84 s","99 s","116 s","135 s"]
["power consumption (5A)","15 s","31 s","49 s","65 s","81 s","95 s","111 s","130 s"]
["power consumption (6A)","12 s","26 s","40 s","55 s","67 s","80 s","94 s","106 s"]
["power consumption (6,5A)","11 s","23 s","37 s","51 s","62 s","74 s","87 s","99 s"]
["All IPCs without power consumption of PCI(e) and USB"]
[]
[null,"Choice ('1')"]
["Temperature 50°C for 8 years:",1,1]
[null,"Performance Multiplier:",1]
[]
[]
[]
["DC UPS with Battery","The right UPS solution for IPC applications in ambient temperatures around 25°C and for buffering long times and high currents"]
["IPC / power consumption in Amper (A)","Batt. Modul UPS1100\n1,2 Ah\nMLFB: \n6EP4133-0GA00-0AY0","Batt. Modul UPS1100\n2,5 Ah high temperatur\nMLFB: \n6EP4132-0GB00-0AY0","Batt. Mod. UPS1100\n3,2 Ah\nMLFB: \n6EP4133-0GA00-0AY0","Batt. Mod. UPS1100\n5 Ah LiFePo\nMLFB: \n6EP4134-0JA00-0AY0","Batt. Modul UPS1100\n7 Ah\nMLFB: \n6EP4134-0GB00-0AY0","Batt. Modul UPS1100\n12 Ah\nMLFB: \n6EP4135-0GE00-0AY0"]
["SITOP UPS1600 10A\nMLFB: 6EP4134-3AB00-1AY0 (USB) \nMLFB: 6EP4134-3AB00-2AY0 (Ethernet / PROFINET)","Buffer Time - Valid for new Batteries at 25° C"]
["SIMATIC IPC127E (0,7A)","40 min","142 min","171 min","371 min","457 min","771 min"]
["SIMATIC IPC227D/E (1,4A)","20 min","71 min","85 min","185 min","228 min","385 min"]
["SIMATIC IPC277E 7\", 9\" (1,4A)","20 min","71 min","85 min","185 min","228 min","385 min"]
["SIMATIC IPC427C/D/E (1,9A)","14 min","52 min","63 min","136 min","168 min","284 min"]
["SIMATIC IPC327E (2,5A)","11 min","40 min","48 min","104 min","128 min","216 min"]
["SIMATIC IPC377E 12\", 15\", 19\" (2,5A)","11 min","40 min","48 min","104 min","128 min","216 min"]
["SIMATIC IPC277E 12\", 15\",19\" (3,0A)","9 min","33 min","40 min","86 min","106 min","180 min"]
["SIMATIC IPC477D/E (3,4A)","9 min","30 min","40 min","82 min","94 min","176 min"]
["SIMATIC IPC627C/D/E (3,5A)","8 min","29 min","38 min","80 min","91 min","171 min"]
["SIMATIC IPC827C/D/E (3,5A)","8 min","29 min","38 min","80 min","91 min","171 min"]
[" SIMATIC IPC677C/D/E (4,8A)","5 min","18 min","26 min","60 min","60 min","112 min"]
["power consumption 5,0A","5 min","18 min","25 min","57 min","57 min","108 min"]
["power consumption 6,0A","4 min","15 min","21 min","48 min","48 min","90 min"]
["power consumption 6,5A","3 min","13 min","18 min","45 min","41 min","73 min"]
["All IPCs without power consumption of PCI(e) and USB"]
[]
[null,"Choice ('1')"]
["Battery aging 4 years at 20°C:",0,1,""]
["Battery 85% message:",0,1]
["Battery temperature less than 25°C:",0,1]
["Battery temperature +5°C:",0,1]
[null,"Performance Multiplier:",1]